{"text_format":"1","workbook":"xlsx","n_sheets":3,"sheets":["List2","Pomocné","Objednávka_1"],"not_rendered":{"charts":0,"images":1,"macros":1,"external_links":0,"defined_names":1,"comments":0,"pivot_tables":0},"unopened":[],"bounds":{"document_bytes":16777216,"sheet_cells":100000,"rows_first":2000,"rows_last":500,"rows_between":2000,"halvings":0,"cell_chars":16384,"cell_head_chars":4096},"cells_cut":0,"cells_raw":0,"read":"whole","date_system":"1900"}

{"sheet":"List2","index":0,"n_rows":9,"n_cols":1,"rows_kept":9,"cut":false,"hidden":true,"merged":[]}
[0.5]
[1]
[2]
["PP"]
[0]
[]
[]
["ROZMĚRY PRO ŘEZÁNÍ U NÁS - BEZ HRAN!"]
["ROZMĚRY PO OHRANĚNÍ! "]

{"sheet":"Pomocné","index":1,"n_rows":5,"n_cols":14,"rows_kept":5,"cut":false,"hidden":true,"merged":[[0,11,0,13]]}
["Z",null,"Sloupec1","jednostranný","oboustranný",null,"ne",null,null,null,null,"Info o zakázce"]
["V",null,"lesk",1600,1600,null,"ano",1800,2000,null,null,"Plocha dílců",{"$f":"Objednávka_1!BH71","v":0},"m2"]
["N",null,"polomat",1200,1250,null,null,null,null,null,null,"Délka broušených hran",{"$f":"Objednávka_1!BI71","v":0},"m"]
[null,null,"mat",900,900]
[null,null,"strukturovaný",1800,2000]

{"sheet":"Objednávka_1","index":2,"n_rows":71,"n_cols":61,"rows_kept":71,"cut":false,"hidden":false,"merged":[[17,40,19,40],[24,22,24,23],[25,22,25,23],[26,22,26,23],[34,22,34,23],[21,22,21,23],[22,22,22,23],[23,22,23,23],[32,22,32,23],[35,22,35,23],[36,22,36,23],[27,22,27,23],[28,22,28,23],[29,22,29,23],[30,22,30,23],[31,22,31,23],[33,22,33,23],[42,22,42,23],[43,22,43,23],[44,22,44,23],[45,22,45,23],[46,22,46,23],[37,22,37,23],[38,22,38,23],[39,22,39,23],[40,22,40,23],[41,22,41,23],[52,22,52,23],[53,22,53,23],[54,22,54,23],[55,22,55,23],[47,22,47,23],[48,22,48,23],[49,22,49,23],[50,22,50,23],[51,22,51,23],[61,22,61,23],[62,22,62,23],[63,22,63,23],[64,22,64,23],[65,22,65,23],[56,22,56,23],[57,22,57,23],[58,22,58,23],[59,22,59,23],[60,22,60,23],[66,22,66,23],[67,22,67,23],[68,22,68,23],[69,22,69,23],[2,8,2,21],[3,8,3,21],[4,8,4,21],[5,8,5,21],[6,8,6,21],[7,8,7,21],[8,8,8,23],[9,8,9,23],[10,8,10,23],[11,8,11,23],[13,8,13,23],[6,22,7,22],[0,0,0,23],[17,35,19,35],[17,36,19,36],[17,37,19,37],[17,38,19,38],[6,23,7,23],[17,25,19,25],[17,20,19,21],[12,8,12,23],[17,22,19,23],[17,39,19,39],[15,0,15,7],[17,0,19,0],[17,10,19,10],[17,4,19,5],[17,1,19,1],[17,11,19,11],[17,2,19,3],[17,6,19,7],[17,8,19,9],[17,26,18,34],[15,22,15,23],[15,8,15,11],[15,12,15,19],[17,12,18,19]]}
[" Výhon 334, 664 63 Přísnotice;                                                 +420 774 070 868;                                                       lakovna@bazantinterier.cz                                                   www.bazant-lakovna.cz"]
[]
[null,null,null,null,null,null,null,"Objednatel:",null,null,null,null,null,null,null,null,null,null,null,null,null,null,"Datum objednání:","2018-10-31"]
[null,null,null,null,null,null,null,"(fakturační adresa)",null,null,null,null,null,null,null,null,null,null,null,null,null,null,"Datum dodání dílců:","2018-10-31"]
[]
[]
[null,null,null,null,null,null,null,"E-mail:",null,null,null,null,null,null,null,null,null,null,null,null,null,null,"Předpokládané datum dokončení zakázky:",{"$f":"Z8","v":"2018-11-28"},null,{"$f":"WORKDAY(X4,15)","v":"2018-11-21"}]
[null,null,null,null,null,null,null,"Telefon:",null,null,null,null,null,null,null,null,null,null,null,null,null,null,null,null,null,{"$f":"WORKDAY(X4,20)","v":"2018-11-28"}]
[]
[null,null,null,null,null,null,null,"Zakázka:"]
[null,null,null,null,null,null,null,"Lak (RAL/NCS):"]
[null,null,null,null,null,null,null,"Povrch (lesk/polomat/mat/strukturovaný):","lesk"]
[null,null,null,null,null,null,null,"Olepit dílce ochrannou folií:","ne"]
[null,null,null,null,null,null,null,"Poznámka k celé zakázce:"]
[]
["Předpokládaná cena (bude potvrzena s objednávkou):",null,null,null,null,null,null,null,{"$f":"SUM(Tabulka3[Sloupec7])","v":0},null,null,null,"Povrch [m2 celkem]:",null,null,null,null,null,null,null,{"$f":"CEILING(SUM(U22:U70),1)","v":0},"m2","(zaokrouhleno na celé m2 nahoru)",null,null,null,null,null,null,null,null,null,null,null,null,null,null,null,null,null,"(Pro správný výpočet ceny je důležité mít vybrán povrch a mít správně vyplněny všechny sloupce objednávky)"]
[]
[null,"Označení                            dílce:","x = délka:   [mm]",null,"y = šířka: [mm]",null,"z = tloušťka: [mm]",null,"počet:           [ks]",null,"Lakováno jedno-stranně","Lakováno obou-stranně","Hrany                                                                       [Z=základ; V=vrch; N=nelakovat]",null,null,null,null,null,null,null,"Povrch                      [m2 celkem]",null,"Poznámka:",null,null,"Lakováno jedno/obou stranně","Hrany                ",null,null,null,null,null,null,null,null,"Povrch                      [m2 plochy]","Povrch                      [m2 hrany]","Cena          [tabulková - hrany]","Cena [tabulková - plocha]","Cena [celkem]","šířka zástřiku jiná než 30mm [mm]"]
[]
[null,null,null,null,null,null,null,null,null,null,null,null,"x1","Zástřik","x2","Zástřik","y1","Zástřik","y2","Zástřik",null,null,null,null,null,null,"Zástřik X1","Zástřik X2","Zástřik Y1","Zástřik Y2","Zástřik 10%","x1","x2","y1","y2",null,null,null,null,null,null,"objednatel","zakazka","Barva","povrch","podlepit","Pozn. Cela zakazka","jednostrane/oboustrane","X1 zastrik ","X2 zastrik","Y1 zastrik","Y2 zastrik",null,"zastřik [mm]","Plocha Zást_X1 [m2]","Plocha Zást_X2 [m2]","Plocha Zást_Y3 [m2]","Plocha Zást_Y4 [m2]","Celkem zástřiky [m2]","Plocha desek [m2]","Obvod desek [m]"]
[null,null,null,null,null,null,null,null,null,null,null,null,null,null,null,null,null,null,null,null,null,null,null,null,null,"Sloupec1","Sloupec2","Sloupec22","Sloupec222","Sloupec23","Sloupec24","Sloupec3","Sloupec4","Sloupec5","Sloupec6","Sloupec64","Sloupec63","Sloupec632","Sloupec62","Sloupec7"]
["1.",null,null,{"$f":"IF(C22=\"\",\"\",\"mm\")","v":""},null,{"$f":"IF(E22=\"\",\"\",\"mm\")","v":""},null,{"$f":"IF(G22=\"\",\"\",\"mm\")","v":""},null,{"$f":"IF(I22=\"\",\"\",\"ks\")","v":""},null,null,null,null,null,null,null,null,null,null,{"$f":"IF(I22=\"\",\"\",Tabulka3[[#This Row],[Sloupec64]]+Tabulka3[[#This Row],[Sloupec63]]+BG22)","v":""},{"$f":"IF(U22=\"\",\"\",\"m2\")","v":""},null,null,{"$f":"IF($I$13=\"ano\",Tabulka3[[#This Row],[Sloupec64]]*100,IF(OR($I$13=\"\",$I$13=\"ne\"),0,\"chyba\"))","v":0},1,false,false,false,false,{"$f":"IF(OR(Tabulka3[[#This Row],[Sloupec2]]=TRUE,Tabulka3[[#This Row],[Sloupec22]]=TRUE,Tabulka3[[#This Row],[Sloupec222]]=TRUE,Tabulka3[[#This Row],[Sloupec23]]=TRUE),1.1,1)","v":1},{"$f":"IF(OR(M22=\"N\",M22=\"\"),0,($C22*$G22/1000000)*I22)","v":0},{"$f":"IF(OR(O22=\"N\",O22=\"\"),0,($C22*$G22/1000000)*I22)","v":0},{"$f":"IF(OR(Q22=\"N\",Q22=\"\"),0,($E22*$G22/1000000)*I22)","v":0},{"$f":"IF(OR(S22=\"N\",S22=\"\"),0,($E22*$G22/1000000)*I22)","v":0},{"$f":"IF(Tabulka3[[#This Row],[Sloupec1]]=1,(C22*E22/1000000)*I22,((C22*E22/1000000)*I22)*2)","v":0},{"$f":"Tabulka3[[#This Row],[Sloupec3]]+Tabulka3[[#This Row],[Sloupec4]]+Tabulka3[[#This Row],[Sloupec5]]+Tabulka3[[#This Row],[Sloupec6]]","v":0},{"$f":"IF($I$12=\"\",0,VLOOKUP($I$12,Pomocné!C:E,2,FALSE))","v":1600},{"$f":"IF(Tabulka3[[#This Row],[Sloupec1]]=1,VLOOKUP($I$12,Tabulka1[],2,FALSE),VLOOKUP($I$12,Tabulka1[],3,FALSE))","v":1600},{"$f":"IF(U22=\"\",0,IF(Tabulka3[[#This Row],[Sloupec24]]=1,Tabulka3[[#This Row],[Sloupec64]]*Tabulka3[[#This Row],[Sloupec62]]+Tabulka3[[#This Row],[Sloupec63]]*Tabulka3[[#This Row],[Sloupec632]]+Y22,(Tabulka3[[#This Row],[Sloupec64]]*Tabulka3[[#This Row],[Sloupec62]]*Tabulka3[[#This Row],[Sloupec24]])+Tabulka3[[#This Row],[Sloupec63]]*Tabulka3[[#This Row],[Sloupec632]]+Y22))","v":0},null,{"$f":"IF($I$3=\"\",\"\",$I$3)","v":""},{"$f":"IF($I$10=\"\",\"\",$I$10)","v":""},{"$f":"IF($I$11=\"\",\"\",$I$11)","v":""},{"$f":"$I$12","v":"lesk"},{"$f":"$I$13","v":"ne"},{"$f":"IF($I$14=\"\",\"\",$I$14)","v":""},{"$f":"IF(Tabulka3[[#This Row],[Sloupec1]]=1,\"Jednostranne\",IF(Tabulka3[[#This Row],[Sloupec1]]=2,\"Oboustranne\",\"Nezadano\"))","v":"Jednostranne"},{"$f":"IF(Tabulka3[[#This Row],[Sloupec2]]=TRUE,\"Zastrik\",IF(Tabulka3[[#This Row],[Sloupec2]]=FALSE,\" \",\"Chyba\"))","v":" "},{"$f":"IF(Tabulka3[[#This Row],[Sloupec22]]=TRUE,\"Zastrik\",IF(Tabulka3[[#This Row],[Sloupec22]]=FALSE,\" \",\"Chyba\"))","v":" "},{"$f":"IF(Tabulka3[[#This Row],[Sloupec222]]=TRUE,\"Zastrik\",IF(Tabulka3[[#This Row],[Sloupec222]]=FALSE,\" \",\"Chyba\"))","v":" "},{"$f":"IF(Tabulka3[[#This Row],[Sloupec23]]=TRUE,\"Zastrik\",IF(Tabulka3[[#This Row],[Sloupec23]]=FALSE,\" \",\"Chyba\"))","v":" "},null,{"$f":"IF(AO22=\"\",30,AO22)","v":30},{"$f":"IF(Tabulka3[[#This Row],[Sloupec2]],($BB22*C22/1000000)*I22,\"\")","v":""},{"$f":"IF(Tabulka3[[#This Row],[Sloupec22]],($BB22*C22/1000000)*I22,\"\")","v":""},{"$f":"IF(Tabulka3[[#This Row],[Sloupec222]],($BB22*E22/1000000)*I22,\"\")","v":""},{"$f":"IF(Tabulka3[[#This Row],[Sloupec23]],($BB22*E22/1000000)*I22,\"\")","v":""},{"$f":"SUM(BC22:BF22)","v":0},{"$f":"(C22*E22*I22)/1000000","v":0},{"$f":"(2*(C22+E22)*I22)/1000","v":0}]
["2.",null,null,{"$f":"IF(C23=\"\",\"\",\"mm\")","v":""},null,{"$f":"IF(E23=\"\",\"\",\"mm\")","v":""},null,{"$f":"IF(G23=\"\",\"\",\"mm\")","v":""},null,{"$f":"IF(I23=\"\",\"\",\"ks\")","v":""},null,null,null,"Z",null,"V",null,null,null,null,{"$f":"IF(I23=\"\",\"\",Tabulka3[[#This Row],[Sloupec64]]+Tabulka3[[#This Row],[Sloupec63]]+BG23)","v":""},{"$f":"IF(U23=\"\",\"\",\"m2\")","v":""},null,null,{"$f":"IF($I$13=\"ano\",Tabulka3[[#This Row],[Sloupec64]]*100,IF(OR($I$13=\"\",$I$13=\"ne\"),0,\"chyba\"))","v":0},1,false,false,false,false,{"$f":"IF(OR(Tabulka3[[#This Row],[Sloupec2]]=TRUE,Tabulka3[[#This Row],[Sloupec22]]=TRUE,Tabulka3[[#This Row],[Sloupec222]]=TRUE,Tabulka3[[#This Row],[Sloupec23]]=TRUE),1.1,1)","v":1},{"$f":"IF(OR(M23=\"N\",M23=\"\"),0,($C23*$G23/1000000)*I23)","v":0},0,0,0,{"$f":"IF(Tabulka3[[#This Row],[Sloupec1]]=1,(C23*E23/1000000)*I23,((C23*E23/1000000)*I23)*2)","v":0},{"$f":"Tabulka3[[#This Row],[Sloupec3]]+Tabulka3[[#This Row],[Sloupec4]]+Tabulka3[[#This Row],[Sloupec5]]+Tabulka3[[#This Row],[Sloupec6]]","v":0},{"$f":"IF($I$12=\"\",0,VLOOKUP($I$12,Pomocné!C:E,2,FALSE))","v":1600},{"$f":"IF(Tabulka3[[#This Row],[Sloupec1]]=1,VLOOKUP($I$12,Tabulka1[],2,FALSE),VLOOKUP($I$12,Tabulka1[],3,FALSE))","v":1600},{"$f":"IF(U23=\"\",0,IF(Tabulka3[[#This Row],[Sloupec24]]=1,Tabulka3[[#This Row],[Sloupec64]]*Tabulka3[[#This Row],[Sloupec62]]+Tabulka3[[#This Row],[Sloupec63]]*Tabulka3[[#This Row],[Sloupec632]]+Y23,(Tabulka3[[#This Row],[Sloupec64]]*Tabulka3[[#This Row],[Sloupec62]]*Tabulka3[[#This Row],[Sloupec24]])+Tabulka3[[#This Row],[Sloupec63]]*Tabulka3[[#This Row],[Sloupec632]]+Y23))","v":0},null,{"$f":"IF($I$3=\"\",\"\",$I$3)","v":""},{"$f":"IF($I$10=\"\",\"\",$I$10)","v":""},{"$f":"IF($I$11=\"\",\"\",$I$11)","v":""},{"$f":"$I$12","v":"lesk"},{"$f":"$I$13","v":"ne"},{"$f":"IF($I$14=\"\",\"\",$I$14)","v":""},{"$f":"IF(Tabulka3[[#This Row],[Sloupec1]]=1,\"Jednostranne\",IF(Tabulka3[[#This Row],[Sloupec1]]=2,\"Oboustranne\",\"Nezadano\"))","v":"Jednostranne"},{"$f":"IF(Tabulka3[[#This Row],[Sloupec2]]=TRUE,\"Zastrik\",IF(Tabulka3[[#This Row],[Sloupec2]]=FALSE,\" \",\"Chyba\"))","v":" "},{"$f":"IF(Tabulka3[[#This Row],[Sloupec22]]=TRUE,\"Zastrik\",IF(Tabulka3[[#This Row],[Sloupec22]]=FALSE,\" \",\"Chyba\"))","v":" "},{"$f":"IF(Tabulka3[[#This Row],[Sloupec222]]=TRUE,\"Zastrik\",IF(Tabulka3[[#This Row],[Sloupec222]]=FALSE,\" \",\"Chyba\"))","v":" "},{"$f":"IF(Tabulka3[[#This Row],[Sloupec23]]=TRUE,\"Zastrik\",IF(Tabulka3[[#This Row],[Sloupec23]]=FALSE,\" \",\"Chyba\"))","v":" "},null,{"$f":"IF(AO23=\"\",30,AO23)","v":30},{"$f":"IF(Tabulka3[[#This Row],[Sloupec2]],($BB23*C23/1000000)*I23,\"\")","v":""},{"$f":"IF(Tabulka3[[#This Row],[Sloupec22]],($BB23*C23/1000000)*I23,\"\")","v":""},{"$f":"IF(Tabulka3[[#This Row],[Sloupec222]],($BB23*E23/1000000)*I23,\"\")","v":""},{"$f":"IF(Tabulka3[[#This Row],[Sloupec23]],($BB23*E23/1000000)*I23,\"\")","v":""},{"$f":"SUM(BC23:BF23)","v":0},{"$f":"(C23*E23*I23)/1000000","v":0},{"$f":"(2*(C23+E23)*I23)/1000","v":0}]
["3.",null,null,"",null,"",null,"",null,"",null,null,null,"Z",null,"V",null,null,null,null,{"$f":"IF(I24=\"\",\"\",Tabulka3[[#This Row],[Sloupec64]]+Tabulka3[[#This Row],[Sloupec63]]+BG24)","v":""},{"$f":"IF(U24=\"\",\"\",\"m2\")","v":""},null,null,{"$f":"IF($I$13=\"ano\",Tabulka3[[#This Row],[Sloupec64]]*100,IF(OR($I$13=\"\",$I$13=\"ne\"),0,\"chyba\"))","v":0},1,false,false,false,false,{"$f":"IF(OR(Tabulka3[[#This Row],[Sloupec2]]=TRUE,Tabulka3[[#This Row],[Sloupec22]]=TRUE,Tabulka3[[#This Row],[Sloupec222]]=TRUE,Tabulka3[[#This Row],[Sloupec23]]=TRUE),1.1,1)","v":1},0,0,0,0,{"$f":"IF(Tabulka3[[#This Row],[Sloupec1]]=1,(C24*E24/1000000)*I24,((C24*E24/1000000)*I24)*2)","v":0},{"$f":"Tabulka3[[#This Row],[Sloupec3]]+Tabulka3[[#This Row],[Sloupec4]]+Tabulka3[[#This Row],[Sloupec5]]+Tabulka3[[#This Row],[Sloupec6]]","v":0},{"$f":"IF($I$12=\"\",0,VLOOKUP($I$12,Pomocné!C:E,2,FALSE))","v":1600},{"$f":"IF(Tabulka3[[#This Row],[Sloupec1]]=1,VLOOKUP($I$12,Tabulka1[],2,FALSE),VLOOKUP($I$12,Tabulka1[],3,FALSE))","v":1600},{"$f":"IF(U24=\"\",0,IF(Tabulka3[[#This Row],[Sloupec24]]=1,Tabulka3[[#This Row],[Sloupec64]]*Tabulka3[[#This Row],[Sloupec62]]+Tabulka3[[#This Row],[Sloupec63]]*Tabulka3[[#This Row],[Sloupec632]]+Y24,(Tabulka3[[#This Row],[Sloupec64]]*Tabulka3[[#This Row],[Sloupec62]]*Tabulka3[[#This Row],[Sloupec24]])+Tabulka3[[#This Row],[Sloupec63]]*Tabulka3[[#This Row],[Sloupec632]]+Y24))","v":0},null,"","","","lesk","ne","",{"$f":"IF(Tabulka3[[#This Row],[Sloupec1]]=1,\"Jednostranne\",IF(Tabulka3[[#This Row],[Sloupec1]]=2,\"Oboustranne\",\"Nezadano\"))","v":"Jednostranne"},{"$f":"IF(Tabulka3[[#This Row],[Sloupec2]]=TRUE,\"Zastrik\",IF(Tabulka3[[#This Row],[Sloupec2]]=FALSE,\" \",\"Chyba\"))","v":" "},{"$f":"IF(Tabulka3[[#This Row],[Sloupec22]]=TRUE,\"Zastrik\",IF(Tabulka3[[#This Row],[Sloupec22]]=FALSE,\" \",\"Chyba\"))","v":" "},{"$f":"IF(Tabulka3[[#This Row],[Sloupec222]]=TRUE,\"Zastrik\",IF(Tabulka3[[#This Row],[Sloupec222]]=FALSE,\" \",\"Chyba\"))","v":" "},{"$f":"IF(Tabulka3[[#This Row],[Sloupec23]]=TRUE,\"Zastrik\",IF(Tabulka3[[#This Row],[Sloupec23]]=FALSE,\" \",\"Chyba\"))","v":" "},null,{"$f":"IF(AO24=\"\",30,AO24)","v":30},{"$f":"IF(Tabulka3[[#This Row],[Sloupec2]],($BB24*C24/1000000)*I24,\"\")","v":""},{"$f":"IF(Tabulka3[[#This Row],[Sloupec22]],($BB24*C24/1000000)*I24,\"\")","v":""},{"$f":"IF(Tabulka3[[#This Row],[Sloupec222]],($BB24*E24/1000000)*I24,\"\")","v":""},{"$f":"IF(Tabulka3[[#This Row],[Sloupec23]],($BB24*E24/1000000)*I24,\"\")","v":""},0,0,0]
["4.",null,null,"",null,"",null,"",null,"",null,null,null,"Z",null,"V",null,null,null,null,{"$f":"IF(I25=\"\",\"\",Tabulka3[[#This Row],[Sloupec64]]+Tabulka3[[#This Row],[Sloupec63]]+BG25)","v":""},"",null,null,{"$f":"IF($I$13=\"ano\",Tabulka3[[#This Row],[Sloupec64]]*100,IF(OR($I$13=\"\",$I$13=\"ne\"),0,\"chyba\"))","v":0},1,false,false,false,false,{"$f":"IF(OR(Tabulka3[[#This Row],[Sloupec2]]=TRUE,Tabulka3[[#This Row],[Sloupec22]]=TRUE,Tabulka3[[#This Row],[Sloupec222]]=TRUE,Tabulka3[[#This Row],[Sloupec23]]=TRUE),1.1,1)","v":1},0,0,0,0,{"$f":"IF(Tabulka3[[#This Row],[Sloupec1]]=1,(C25*E25/1000000)*I25,((C25*E25/1000000)*I25)*2)","v":0},{"$f":"Tabulka3[[#This Row],[Sloupec3]]+Tabulka3[[#This Row],[Sloupec4]]+Tabulka3[[#This Row],[Sloupec5]]+Tabulka3[[#This Row],[Sloupec6]]","v":0},{"$f":"IF($I$12=\"\",0,VLOOKUP($I$12,Pomocné!C:E,2,FALSE))","v":1600},{"$f":"IF(Tabulka3[[#This Row],[Sloupec1]]=1,VLOOKUP($I$12,Tabulka1[],2,FALSE),VLOOKUP($I$12,Tabulka1[],3,FALSE))","v":1600},{"$f":"IF(U25=\"\",0,IF(Tabulka3[[#This Row],[Sloupec24]]=1,Tabulka3[[#This Row],[Sloupec64]]*Tabulka3[[#This Row],[Sloupec62]]+Tabulka3[[#This Row],[Sloupec63]]*Tabulka3[[#This Row],[Sloupec632]]+Y25,(Tabulka3[[#This Row],[Sloupec64]]*Tabulka3[[#This Row],[Sloupec62]]*Tabulka3[[#This Row],[Sloupec24]])+Tabulka3[[#This Row],[Sloupec63]]*Tabulka3[[#This Row],[Sloupec632]]+Y25))","v":0},null,"","","","lesk","ne","",{"$f":"IF(Tabulka3[[#This Row],[Sloupec1]]=1,\"Jednostranne\",IF(Tabulka3[[#This Row],[Sloupec1]]=2,\"Oboustranne\",\"Nezadano\"))","v":"Jednostranne"},{"$f":"IF(Tabulka3[[#This Row],[Sloupec2]]=TRUE,\"Zastrik\",IF(Tabulka3[[#This Row],[Sloupec2]]=FALSE,\" \",\"Chyba\"))","v":" "},{"$f":"IF(Tabulka3[[#This Row],[Sloupec22]]=TRUE,\"Zastrik\",IF(Tabulka3[[#This Row],[Sloupec22]]=FALSE,\" \",\"Chyba\"))","v":" "},{"$f":"IF(Tabulka3[[#This Row],[Sloupec222]]=TRUE,\"Zastrik\",IF(Tabulka3[[#This Row],[Sloupec222]]=FALSE,\" \",\"Chyba\"))","v":" "},{"$f":"IF(Tabulka3[[#This Row],[Sloupec23]]=TRUE,\"Zastrik\",IF(Tabulka3[[#This Row],[Sloupec23]]=FALSE,\" \",\"Chyba\"))","v":" "},null,{"$f":"IF(AO25=\"\",30,AO25)","v":30},{"$f":"IF(Tabulka3[[#This Row],[Sloupec2]],($BB25*C25/1000000)*I25,\"\")","v":""},{"$f":"IF(Tabulka3[[#This Row],[Sloupec22]],($BB25*C25/1000000)*I25,\"\")","v":""},{"$f":"IF(Tabulka3[[#This Row],[Sloupec222]],($BB25*E25/1000000)*I25,\"\")","v":""},{"$f":"IF(Tabulka3[[#This Row],[Sloupec23]],($BB25*E25/1000000)*I25,\"\")","v":""},0,0,0]
["5.",null,null,"",null,"",null,"",null,"",null,null,null,null,null,null,null,null,null,null,{"$f":"IF(I26=\"\",\"\",Tabulka3[[#This Row],[Sloupec64]]+Tabulka3[[#This Row],[Sloupec63]]+BG26)","v":""},"",null,null,{"$f":"IF($I$13=\"ano\",Tabulka3[[#This Row],[Sloupec64]]*100,IF(OR($I$13=\"\",$I$13=\"ne\"),0,\"chyba\"))","v":0},1,false,false,false,false,{"$f":"IF(OR(Tabulka3[[#This Row],[Sloupec2]]=TRUE,Tabulka3[[#This Row],[Sloupec22]]=TRUE,Tabulka3[[#This Row],[Sloupec222]]=TRUE,Tabulka3[[#This Row],[Sloupec23]]=TRUE),1.1,1)","v":1},0,0,0,0,{"$f":"IF(Tabulka3[[#This Row],[Sloupec1]]=1,(C26*E26/1000000)*I26,((C26*E26/1000000)*I26)*2)","v":0},{"$f":"Tabulka3[[#This Row],[Sloupec3]]+Tabulka3[[#This Row],[Sloupec4]]+Tabulka3[[#This Row],[Sloupec5]]+Tabulka3[[#This Row],[Sloupec6]]","v":0},{"$f":"IF($I$12=\"\",0,VLOOKUP($I$12,Pomocné!C:E,2,FALSE))","v":1600},{"$f":"IF(Tabulka3[[#This Row],[Sloupec1]]=1,VLOOKUP($I$12,Tabulka1[],2,FALSE),VLOOKUP($I$12,Tabulka1[],3,FALSE))","v":1600},{"$f":"IF(U26=\"\",0,IF(Tabulka3[[#This Row],[Sloupec24]]=1,Tabulka3[[#This Row],[Sloupec64]]*Tabulka3[[#This Row],[Sloupec62]]+Tabulka3[[#This Row],[Sloupec63]]*Tabulka3[[#This Row],[Sloupec632]]+Y26,(Tabulka3[[#This Row],[Sloupec64]]*Tabulka3[[#This Row],[Sloupec62]]*Tabulka3[[#This Row],[Sloupec24]])+Tabulka3[[#This Row],[Sloupec63]]*Tabulka3[[#This Row],[Sloupec632]]+Y26))","v":0},null,"","","","lesk","ne","",{"$f":"IF(Tabulka3[[#This Row],[Sloupec1]]=1,\"Jednostranne\",IF(Tabulka3[[#This Row],[Sloupec1]]=2,\"Oboustranne\",\"Nezadano\"))","v":"Jednostranne"},{"$f":"IF(Tabulka3[[#This Row],[Sloupec2]]=TRUE,\"Zastrik\",IF(Tabulka3[[#This Row],[Sloupec2]]=FALSE,\" \",\"Chyba\"))","v":" "},{"$f":"IF(Tabulka3[[#This Row],[Sloupec22]]=TRUE,\"Zastrik\",IF(Tabulka3[[#This Row],[Sloupec22]]=FALSE,\" \",\"Chyba\"))","v":" "},{"$f":"IF(Tabulka3[[#This Row],[Sloupec222]]=TRUE,\"Zastrik\",IF(Tabulka3[[#This Row],[Sloupec222]]=FALSE,\" \",\"Chyba\"))","v":" "},{"$f":"IF(Tabulka3[[#This Row],[Sloupec23]]=TRUE,\"Zastrik\",IF(Tabulka3[[#This Row],[Sloupec23]]=FALSE,\" \",\"Chyba\"))","v":" "},null,{"$f":"IF(AO26=\"\",30,AO26)","v":30},{"$f":"IF(Tabulka3[[#This Row],[Sloupec2]],($BB26*C26/1000000)*I26,\"\")","v":""},{"$f":"IF(Tabulka3[[#This Row],[Sloupec22]],($BB26*C26/1000000)*I26,\"\")","v":""},{"$f":"IF(Tabulka3[[#This Row],[Sloupec222]],($BB26*E26/1000000)*I26,\"\")","v":""},{"$f":"IF(Tabulka3[[#This Row],[Sloupec23]],($BB26*E26/1000000)*I26,\"\")","v":""},0,0,0]
["6.",null,null,"",null,"",null,"",null,"",null,null,null,null,null,null,null,null,null,null,{"$f":"IF(I27=\"\",\"\",Tabulka3[[#This Row],[Sloupec64]]+Tabulka3[[#This Row],[Sloupec63]]+BG27)","v":""},"",null,null,{"$f":"IF($I$13=\"ano\",Tabulka3[[#This Row],[Sloupec64]]*100,IF(OR($I$13=\"\",$I$13=\"ne\"),0,\"chyba\"))","v":0},1,false,false,false,false,{"$f":"IF(OR(Tabulka3[[#This Row],[Sloupec2]]=TRUE,Tabulka3[[#This Row],[Sloupec22]]=TRUE,Tabulka3[[#This Row],[Sloupec222]]=TRUE,Tabulka3[[#This Row],[Sloupec23]]=TRUE),1.1,1)","v":1},0,0,0,0,{"$f":"IF(Tabulka3[[#This Row],[Sloupec1]]=1,(C27*E27/1000000)*I27,((C27*E27/1000000)*I27)*2)","v":0},{"$f":"Tabulka3[[#This Row],[Sloupec3]]+Tabulka3[[#This Row],[Sloupec4]]+Tabulka3[[#This Row],[Sloupec5]]+Tabulka3[[#This Row],[Sloupec6]]","v":0},{"$f":"IF($I$12=\"\",0,VLOOKUP($I$12,Pomocné!C:E,2,FALSE))","v":1600},{"$f":"IF(Tabulka3[[#This Row],[Sloupec1]]=1,VLOOKUP($I$12,Tabulka1[],2,FALSE),VLOOKUP($I$12,Tabulka1[],3,FALSE))","v":1600},{"$f":"IF(U27=\"\",0,IF(Tabulka3[[#This Row],[Sloupec24]]=1,Tabulka3[[#This Row],[Sloupec64]]*Tabulka3[[#This Row],[Sloupec62]]+Tabulka3[[#This Row],[Sloupec63]]*Tabulka3[[#This Row],[Sloupec632]]+Y27,(Tabulka3[[#This Row],[Sloupec64]]*Tabulka3[[#This Row],[Sloupec62]]*Tabulka3[[#This Row],[Sloupec24]])+Tabulka3[[#This Row],[Sloupec63]]*Tabulka3[[#This Row],[Sloupec632]]+Y27))","v":0},null,"","","","lesk","ne","",{"$f":"IF(Tabulka3[[#This Row],[Sloupec1]]=1,\"Jednostranne\",IF(Tabulka3[[#This Row],[Sloupec1]]=2,\"Oboustranne\",\"Nezadano\"))","v":"Jednostranne"},{"$f":"IF(Tabulka3[[#This Row],[Sloupec2]]=TRUE,\"Zastrik\",IF(Tabulka3[[#This Row],[Sloupec2]]=FALSE,\" \",\"Chyba\"))","v":" "},{"$f":"IF(Tabulka3[[#This Row],[Sloupec22]]=TRUE,\"Zastrik\",IF(Tabulka3[[#This Row],[Sloupec22]]=FALSE,\" \",\"Chyba\"))","v":" "},{"$f":"IF(Tabulka3[[#This Row],[Sloupec222]]=TRUE,\"Zastrik\",IF(Tabulka3[[#This Row],[Sloupec222]]=FALSE,\" \",\"Chyba\"))","v":" "},{"$f":"IF(Tabulka3[[#This Row],[Sloupec23]]=TRUE,\"Zastrik\",IF(Tabulka3[[#This Row],[Sloupec23]]=FALSE,\" \",\"Chyba\"))","v":" "},null,{"$f":"IF(AO27=\"\",30,AO27)","v":30},{"$f":"IF(Tabulka3[[#This Row],[Sloupec2]],($BB27*C27/1000000)*I27,\"\")","v":""},{"$f":"IF(Tabulka3[[#This Row],[Sloupec22]],($BB27*C27/1000000)*I27,\"\")","v":""},{"$f":"IF(Tabulka3[[#This Row],[Sloupec222]],($BB27*E27/1000000)*I27,\"\")","v":""},{"$f":"IF(Tabulka3[[#This Row],[Sloupec23]],($BB27*E27/1000000)*I27,\"\")","v":""},0,0,0]
["7.",null,null,"",null,"",null,"",null,"",null,null,null,null,null,null,null,null,null,null,{"$f":"IF(I28=\"\",\"\",Tabulka3[[#This Row],[Sloupec64]]+Tabulka3[[#This Row],[Sloupec63]]+BG28)","v":""},"",null,null,{"$f":"IF($I$13=\"ano\",Tabulka3[[#This Row],[Sloupec64]]*100,IF(OR($I$13=\"\",$I$13=\"ne\"),0,\"chyba\"))","v":0},1,false,false,false,false,{"$f":"IF(OR(Tabulka3[[#This Row],[Sloupec2]]=TRUE,Tabulka3[[#This Row],[Sloupec22]]=TRUE,Tabulka3[[#This Row],[Sloupec222]]=TRUE,Tabulka3[[#This Row],[Sloupec23]]=TRUE),1.1,1)","v":1},0,0,0,0,{"$f":"IF(Tabulka3[[#This Row],[Sloupec1]]=1,(C28*E28/1000000)*I28,((C28*E28/1000000)*I28)*2)","v":0},{"$f":"Tabulka3[[#This Row],[Sloupec3]]+Tabulka3[[#This Row],[Sloupec4]]+Tabulka3[[#This Row],[Sloupec5]]+Tabulka3[[#This Row],[Sloupec6]]","v":0},{"$f":"IF($I$12=\"\",0,VLOOKUP($I$12,Pomocné!C:E,2,FALSE))","v":1600},{"$f":"IF(Tabulka3[[#This Row],[Sloupec1]]=1,VLOOKUP($I$12,Tabulka1[],2,FALSE),VLOOKUP($I$12,Tabulka1[],3,FALSE))","v":1600},{"$f":"IF(U28=\"\",0,IF(Tabulka3[[#This Row],[Sloupec24]]=1,Tabulka3[[#This Row],[Sloupec64]]*Tabulka3[[#This Row],[Sloupec62]]+Tabulka3[[#This Row],[Sloupec63]]*Tabulka3[[#This Row],[Sloupec632]]+Y28,(Tabulka3[[#This Row],[Sloupec64]]*Tabulka3[[#This Row],[Sloupec62]]*Tabulka3[[#This Row],[Sloupec24]])+Tabulka3[[#This Row],[Sloupec63]]*Tabulka3[[#This Row],[Sloupec632]]+Y28))","v":0},null,"","","","lesk","ne","",{"$f":"IF(Tabulka3[[#This Row],[Sloupec1]]=1,\"Jednostranne\",IF(Tabulka3[[#This Row],[Sloupec1]]=2,\"Oboustranne\",\"Nezadano\"))","v":"Jednostranne"},{"$f":"IF(Tabulka3[[#This Row],[Sloupec2]]=TRUE,\"Zastrik\",IF(Tabulka3[[#This Row],[Sloupec2]]=FALSE,\" \",\"Chyba\"))","v":" "},{"$f":"IF(Tabulka3[[#This Row],[Sloupec22]]=TRUE,\"Zastrik\",IF(Tabulka3[[#This Row],[Sloupec22]]=FALSE,\" \",\"Chyba\"))","v":" "},{"$f":"IF(Tabulka3[[#This Row],[Sloupec222]]=TRUE,\"Zastrik\",IF(Tabulka3[[#This Row],[Sloupec222]]=FALSE,\" \",\"Chyba\"))","v":" "},{"$f":"IF(Tabulka3[[#This Row],[Sloupec23]]=TRUE,\"Zastrik\",IF(Tabulka3[[#This Row],[Sloupec23]]=FALSE,\" \",\"Chyba\"))","v":" "},null,{"$f":"IF(AO28=\"\",30,AO28)","v":30},{"$f":"IF(Tabulka3[[#This Row],[Sloupec2]],($BB28*C28/1000000)*I28,\"\")","v":""},{"$f":"IF(Tabulka3[[#This Row],[Sloupec22]],($BB28*C28/1000000)*I28,\"\")","v":""},{"$f":"IF(Tabulka3[[#This Row],[Sloupec222]],($BB28*E28/1000000)*I28,\"\")","v":""},{"$f":"IF(Tabulka3[[#This Row],[Sloupec23]],($BB28*E28/1000000)*I28,\"\")","v":""},0,0,0]
["8.",null,null,"",null,"",null,"",null,"",null,null,null,null,null,null,null,null,null,null,{"$f":"IF(I29=\"\",\"\",Tabulka3[[#This Row],[Sloupec64]]+Tabulka3[[#This Row],[Sloupec63]]+BG29)","v":""},"",null,null,{"$f":"IF($I$13=\"ano\",Tabulka3[[#This Row],[Sloupec64]]*100,IF(OR($I$13=\"\",$I$13=\"ne\"),0,\"chyba\"))","v":0},1,false,false,false,false,{"$f":"IF(OR(Tabulka3[[#This Row],[Sloupec2]]=TRUE,Tabulka3[[#This Row],[Sloupec22]]=TRUE,Tabulka3[[#This Row],[Sloupec222]]=TRUE,Tabulka3[[#This Row],[Sloupec23]]=TRUE),1.1,1)","v":1},0,0,0,0,{"$f":"IF(Tabulka3[[#This Row],[Sloupec1]]=1,(C29*E29/1000000)*I29,((C29*E29/1000000)*I29)*2)","v":0},{"$f":"Tabulka3[[#This Row],[Sloupec3]]+Tabulka3[[#This Row],[Sloupec4]]+Tabulka3[[#This Row],[Sloupec5]]+Tabulka3[[#This Row],[Sloupec6]]","v":0},{"$f":"IF($I$12=\"\",0,VLOOKUP($I$12,Pomocné!C:E,2,FALSE))","v":1600},{"$f":"IF(Tabulka3[[#This Row],[Sloupec1]]=1,VLOOKUP($I$12,Tabulka1[],2,FALSE),VLOOKUP($I$12,Tabulka1[],3,FALSE))","v":1600},{"$f":"IF(U29=\"\",0,IF(Tabulka3[[#This Row],[Sloupec24]]=1,Tabulka3[[#This Row],[Sloupec64]]*Tabulka3[[#This Row],[Sloupec62]]+Tabulka3[[#This Row],[Sloupec63]]*Tabulka3[[#This Row],[Sloupec632]]+Y29,(Tabulka3[[#This Row],[Sloupec64]]*Tabulka3[[#This Row],[Sloupec62]]*Tabulka3[[#This Row],[Sloupec24]])+Tabulka3[[#This Row],[Sloupec63]]*Tabulka3[[#This Row],[Sloupec632]]+Y29))","v":0},null,"","","","lesk","ne","",{"$f":"IF(Tabulka3[[#This Row],[Sloupec1]]=1,\"Jednostranne\",IF(Tabulka3[[#This Row],[Sloupec1]]=2,\"Oboustranne\",\"Nezadano\"))","v":"Jednostranne"},{"$f":"IF(Tabulka3[[#This Row],[Sloupec2]]=TRUE,\"Zastrik\",IF(Tabulka3[[#This Row],[Sloupec2]]=FALSE,\" \",\"Chyba\"))","v":" "},{"$f":"IF(Tabulka3[[#This Row],[Sloupec22]]=TRUE,\"Zastrik\",IF(Tabulka3[[#This Row],[Sloupec22]]=FALSE,\" \",\"Chyba\"))","v":" "},{"$f":"IF(Tabulka3[[#This Row],[Sloupec222]]=TRUE,\"Zastrik\",IF(Tabulka3[[#This Row],[Sloupec222]]=FALSE,\" \",\"Chyba\"))","v":" "},{"$f":"IF(Tabulka3[[#This Row],[Sloupec23]]=TRUE,\"Zastrik\",IF(Tabulka3[[#This Row],[Sloupec23]]=FALSE,\" \",\"Chyba\"))","v":" "},null,{"$f":"IF(AO29=\"\",30,AO29)","v":30},{"$f":"IF(Tabulka3[[#This Row],[Sloupec2]],($BB29*C29/1000000)*I29,\"\")","v":""},{"$f":"IF(Tabulka3[[#This Row],[Sloupec22]],($BB29*C29/1000000)*I29,\"\")","v":""},{"$f":"IF(Tabulka3[[#This Row],[Sloupec222]],($BB29*E29/1000000)*I29,\"\")","v":""},{"$f":"IF(Tabulka3[[#This Row],[Sloupec23]],($BB29*E29/1000000)*I29,\"\")","v":""},0,0,0]
["9.",null,null,"",null,"",null,"",null,"",null,null,null,null,null,null,null,null,null,null,{"$f":"IF(I30=\"\",\"\",Tabulka3[[#This Row],[Sloupec64]]+Tabulka3[[#This Row],[Sloupec63]]+BG30)","v":""},"",null,null,{"$f":"IF($I$13=\"ano\",Tabulka3[[#This Row],[Sloupec64]]*100,IF(OR($I$13=\"\",$I$13=\"ne\"),0,\"chyba\"))","v":0},1,false,false,false,false,{"$f":"IF(OR(Tabulka3[[#This Row],[Sloupec2]]=TRUE,Tabulka3[[#This Row],[Sloupec22]]=TRUE,Tabulka3[[#This Row],[Sloupec222]]=TRUE,Tabulka3[[#This Row],[Sloupec23]]=TRUE),1.1,1)","v":1},0,0,0,0,{"$f":"IF(Tabulka3[[#This Row],[Sloupec1]]=1,(C30*E30/1000000)*I30,((C30*E30/1000000)*I30)*2)","v":0},{"$f":"Tabulka3[[#This Row],[Sloupec3]]+Tabulka3[[#This Row],[Sloupec4]]+Tabulka3[[#This Row],[Sloupec5]]+Tabulka3[[#This Row],[Sloupec6]]","v":0},{"$f":"IF($I$12=\"\",0,VLOOKUP($I$12,Pomocné!C:E,2,FALSE))","v":1600},{"$f":"IF(Tabulka3[[#This Row],[Sloupec1]]=1,VLOOKUP($I$12,Tabulka1[],2,FALSE),VLOOKUP($I$12,Tabulka1[],3,FALSE))","v":1600},{"$f":"IF(U30=\"\",0,IF(Tabulka3[[#This Row],[Sloupec24]]=1,Tabulka3[[#This Row],[Sloupec64]]*Tabulka3[[#This Row],[Sloupec62]]+Tabulka3[[#This Row],[Sloupec63]]*Tabulka3[[#This Row],[Sloupec632]]+Y30,(Tabulka3[[#This Row],[Sloupec64]]*Tabulka3[[#This Row],[Sloupec62]]*Tabulka3[[#This Row],[Sloupec24]])+Tabulka3[[#This Row],[Sloupec63]]*Tabulka3[[#This Row],[Sloupec632]]+Y30))","v":0},null,"","","","lesk","ne","",{"$f":"IF(Tabulka3[[#This Row],[Sloupec1]]=1,\"Jednostranne\",IF(Tabulka3[[#This Row],[Sloupec1]]=2,\"Oboustranne\",\"Nezadano\"))","v":"Jednostranne"},{"$f":"IF(Tabulka3[[#This Row],[Sloupec2]]=TRUE,\"Zastrik\",IF(Tabulka3[[#This Row],[Sloupec2]]=FALSE,\" \",\"Chyba\"))","v":" "},{"$f":"IF(Tabulka3[[#This Row],[Sloupec22]]=TRUE,\"Zastrik\",IF(Tabulka3[[#This Row],[Sloupec22]]=FALSE,\" \",\"Chyba\"))","v":" "},{"$f":"IF(Tabulka3[[#This Row],[Sloupec222]]=TRUE,\"Zastrik\",IF(Tabulka3[[#This Row],[Sloupec222]]=FALSE,\" \",\"Chyba\"))","v":" "},{"$f":"IF(Tabulka3[[#This Row],[Sloupec23]]=TRUE,\"Zastrik\",IF(Tabulka3[[#This Row],[Sloupec23]]=FALSE,\" \",\"Chyba\"))","v":" "},null,{"$f":"IF(AO30=\"\",30,AO30)","v":30},{"$f":"IF(Tabulka3[[#This Row],[Sloupec2]],($BB30*C30/1000000)*I30,\"\")","v":""},{"$f":"IF(Tabulka3[[#This Row],[Sloupec22]],($BB30*C30/1000000)*I30,\"\")","v":""},{"$f":"IF(Tabulka3[[#This Row],[Sloupec222]],($BB30*E30/1000000)*I30,\"\")","v":""},{"$f":"IF(Tabulka3[[#This Row],[Sloupec23]],($BB30*E30/1000000)*I30,\"\")","v":""},0,0,0]
["10.",null,null,"",null,"",null,"",null,"",null,null,null,null,null,null,null,null,null,null,{"$f":"IF(I31=\"\",\"\",Tabulka3[[#This Row],[Sloupec64]]+Tabulka3[[#This Row],[Sloupec63]]+BG31)","v":""},"",null,null,{"$f":"IF($I$13=\"ano\",Tabulka3[[#This Row],[Sloupec64]]*100,IF(OR($I$13=\"\",$I$13=\"ne\"),0,\"chyba\"))","v":0},1,false,false,false,false,{"$f":"IF(OR(Tabulka3[[#This Row],[Sloupec2]]=TRUE,Tabulka3[[#This Row],[Sloupec22]]=TRUE,Tabulka3[[#This Row],[Sloupec222]]=TRUE,Tabulka3[[#This Row],[Sloupec23]]=TRUE),1.1,1)","v":1},0,0,0,0,{"$f":"IF(Tabulka3[[#This Row],[Sloupec1]]=1,(C31*E31/1000000)*I31,((C31*E31/1000000)*I31)*2)","v":0},{"$f":"Tabulka3[[#This Row],[Sloupec3]]+Tabulka3[[#This Row],[Sloupec4]]+Tabulka3[[#This Row],[Sloupec5]]+Tabulka3[[#This Row],[Sloupec6]]","v":0},{"$f":"IF($I$12=\"\",0,VLOOKUP($I$12,Pomocné!C:E,2,FALSE))","v":1600},{"$f":"IF(Tabulka3[[#This Row],[Sloupec1]]=1,VLOOKUP($I$12,Tabulka1[],2,FALSE),VLOOKUP($I$12,Tabulka1[],3,FALSE))","v":1600},{"$f":"IF(U31=\"\",0,IF(Tabulka3[[#This Row],[Sloupec24]]=1,Tabulka3[[#This Row],[Sloupec64]]*Tabulka3[[#This Row],[Sloupec62]]+Tabulka3[[#This Row],[Sloupec63]]*Tabulka3[[#This Row],[Sloupec632]]+Y31,(Tabulka3[[#This Row],[Sloupec64]]*Tabulka3[[#This Row],[Sloupec62]]*Tabulka3[[#This Row],[Sloupec24]])+Tabulka3[[#This Row],[Sloupec63]]*Tabulka3[[#This Row],[Sloupec632]]+Y31))","v":0},null,"","","","lesk","ne","",{"$f":"IF(Tabulka3[[#This Row],[Sloupec1]]=1,\"Jednostranne\",IF(Tabulka3[[#This Row],[Sloupec1]]=2,\"Oboustranne\",\"Nezadano\"))","v":"Jednostranne"},{"$f":"IF(Tabulka3[[#This Row],[Sloupec2]]=TRUE,\"Zastrik\",IF(Tabulka3[[#This Row],[Sloupec2]]=FALSE,\" \",\"Chyba\"))","v":" "},{"$f":"IF(Tabulka3[[#This Row],[Sloupec22]]=TRUE,\"Zastrik\",IF(Tabulka3[[#This Row],[Sloupec22]]=FALSE,\" \",\"Chyba\"))","v":" "},{"$f":"IF(Tabulka3[[#This Row],[Sloupec222]]=TRUE,\"Zastrik\",IF(Tabulka3[[#This Row],[Sloupec222]]=FALSE,\" \",\"Chyba\"))","v":" "},{"$f":"IF(Tabulka3[[#This Row],[Sloupec23]]=TRUE,\"Zastrik\",IF(Tabulka3[[#This Row],[Sloupec23]]=FALSE,\" \",\"Chyba\"))","v":" "},null,{"$f":"IF(AO31=\"\",30,AO31)","v":30},{"$f":"IF(Tabulka3[[#This Row],[Sloupec2]],($BB31*C31/1000000)*I31,\"\")","v":""},{"$f":"IF(Tabulka3[[#This Row],[Sloupec22]],($BB31*C31/1000000)*I31,\"\")","v":""},{"$f":"IF(Tabulka3[[#This Row],[Sloupec222]],($BB31*E31/1000000)*I31,\"\")","v":""},{"$f":"IF(Tabulka3[[#This Row],[Sloupec23]],($BB31*E31/1000000)*I31,\"\")","v":""},0,0,0]
["11.",null,null,"",null,"",null,"",null,"",null,null,null,null,null,null,null,null,null,null,{"$f":"IF(I32=\"\",\"\",Tabulka3[[#This Row],[Sloupec64]]+Tabulka3[[#This Row],[Sloupec63]]+BG32)","v":""},"",null,null,{"$f":"IF($I$13=\"ano\",Tabulka3[[#This Row],[Sloupec64]]*100,IF(OR($I$13=\"\",$I$13=\"ne\"),0,\"chyba\"))","v":0},1,false,false,false,false,{"$f":"IF(OR(Tabulka3[[#This Row],[Sloupec2]]=TRUE,Tabulka3[[#This Row],[Sloupec22]]=TRUE,Tabulka3[[#This Row],[Sloupec222]]=TRUE,Tabulka3[[#This Row],[Sloupec23]]=TRUE),1.1,1)","v":1},0,0,0,0,{"$f":"IF(Tabulka3[[#This Row],[Sloupec1]]=1,(C32*E32/1000000)*I32,((C32*E32/1000000)*I32)*2)","v":0},{"$f":"Tabulka3[[#This Row],[Sloupec3]]+Tabulka3[[#This Row],[Sloupec4]]+Tabulka3[[#This Row],[Sloupec5]]+Tabulka3[[#This Row],[Sloupec6]]","v":0},{"$f":"IF($I$12=\"\",0,VLOOKUP($I$12,Pomocné!C:E,2,FALSE))","v":1600},{"$f":"IF(Tabulka3[[#This Row],[Sloupec1]]=1,VLOOKUP($I$12,Tabulka1[],2,FALSE),VLOOKUP($I$12,Tabulka1[],3,FALSE))","v":1600},{"$f":"IF(U32=\"\",0,IF(Tabulka3[[#This Row],[Sloupec24]]=1,Tabulka3[[#This Row],[Sloupec64]]*Tabulka3[[#This Row],[Sloupec62]]+Tabulka3[[#This Row],[Sloupec63]]*Tabulka3[[#This Row],[Sloupec632]]+Y32,(Tabulka3[[#This Row],[Sloupec64]]*Tabulka3[[#This Row],[Sloupec62]]*Tabulka3[[#This Row],[Sloupec24]])+Tabulka3[[#This Row],[Sloupec63]]*Tabulka3[[#This Row],[Sloupec632]]+Y32))","v":0},null,"","","","lesk","ne","",{"$f":"IF(Tabulka3[[#This Row],[Sloupec1]]=1,\"Jednostranne\",IF(Tabulka3[[#This Row],[Sloupec1]]=2,\"Oboustranne\",\"Nezadano\"))","v":"Jednostranne"},{"$f":"IF(Tabulka3[[#This Row],[Sloupec2]]=TRUE,\"Zastrik\",IF(Tabulka3[[#This Row],[Sloupec2]]=FALSE,\" \",\"Chyba\"))","v":" "},{"$f":"IF(Tabulka3[[#This Row],[Sloupec22]]=TRUE,\"Zastrik\",IF(Tabulka3[[#This Row],[Sloupec22]]=FALSE,\" \",\"Chyba\"))","v":" "},{"$f":"IF(Tabulka3[[#This Row],[Sloupec222]]=TRUE,\"Zastrik\",IF(Tabulka3[[#This Row],[Sloupec222]]=FALSE,\" \",\"Chyba\"))","v":" "},{"$f":"IF(Tabulka3[[#This Row],[Sloupec23]]=TRUE,\"Zastrik\",IF(Tabulka3[[#This Row],[Sloupec23]]=FALSE,\" \",\"Chyba\"))","v":" "},null,{"$f":"IF(AO32=\"\",30,AO32)","v":30},{"$f":"IF(Tabulka3[[#This Row],[Sloupec2]],($BB32*C32/1000000)*I32,\"\")","v":""},{"$f":"IF(Tabulka3[[#This Row],[Sloupec22]],($BB32*C32/1000000)*I32,\"\")","v":""},{"$f":"IF(Tabulka3[[#This Row],[Sloupec222]],($BB32*E32/1000000)*I32,\"\")","v":""},{"$f":"IF(Tabulka3[[#This Row],[Sloupec23]],($BB32*E32/1000000)*I32,\"\")","v":""},0,0,0]
["12.",null,null,"",null,"",null,"",null,"",null,null,null,null,null,null,null,null,null,null,{"$f":"IF(I33=\"\",\"\",Tabulka3[[#This Row],[Sloupec64]]+Tabulka3[[#This Row],[Sloupec63]]+BG33)","v":""},"",null,null,{"$f":"IF($I$13=\"ano\",Tabulka3[[#This Row],[Sloupec64]]*100,IF(OR($I$13=\"\",$I$13=\"ne\"),0,\"chyba\"))","v":0},1,false,false,false,false,{"$f":"IF(OR(Tabulka3[[#This Row],[Sloupec2]]=TRUE,Tabulka3[[#This Row],[Sloupec22]]=TRUE,Tabulka3[[#This Row],[Sloupec222]]=TRUE,Tabulka3[[#This Row],[Sloupec23]]=TRUE),1.1,1)","v":1},0,0,0,0,{"$f":"IF(Tabulka3[[#This Row],[Sloupec1]]=1,(C33*E33/1000000)*I33,((C33*E33/1000000)*I33)*2)","v":0},{"$f":"Tabulka3[[#This Row],[Sloupec3]]+Tabulka3[[#This Row],[Sloupec4]]+Tabulka3[[#This Row],[Sloupec5]]+Tabulka3[[#This Row],[Sloupec6]]","v":0},{"$f":"IF($I$12=\"\",0,VLOOKUP($I$12,Pomocné!C:E,2,FALSE))","v":1600},{"$f":"IF(Tabulka3[[#This Row],[Sloupec1]]=1,VLOOKUP($I$12,Tabulka1[],2,FALSE),VLOOKUP($I$12,Tabulka1[],3,FALSE))","v":1600},{"$f":"IF(U33=\"\",0,IF(Tabulka3[[#This Row],[Sloupec24]]=1,Tabulka3[[#This Row],[Sloupec64]]*Tabulka3[[#This Row],[Sloupec62]]+Tabulka3[[#This Row],[Sloupec63]]*Tabulka3[[#This Row],[Sloupec632]]+Y33,(Tabulka3[[#This Row],[Sloupec64]]*Tabulka3[[#This Row],[Sloupec62]]*Tabulka3[[#This Row],[Sloupec24]])+Tabulka3[[#This Row],[Sloupec63]]*Tabulka3[[#This Row],[Sloupec632]]+Y33))","v":0},null,"","","","lesk","ne","",{"$f":"IF(Tabulka3[[#This Row],[Sloupec1]]=1,\"Jednostranne\",IF(Tabulka3[[#This Row],[Sloupec1]]=2,\"Oboustranne\",\"Nezadano\"))","v":"Jednostranne"},{"$f":"IF(Tabulka3[[#This Row],[Sloupec2]]=TRUE,\"Zastrik\",IF(Tabulka3[[#This Row],[Sloupec2]]=FALSE,\" \",\"Chyba\"))","v":" "},{"$f":"IF(Tabulka3[[#This Row],[Sloupec22]]=TRUE,\"Zastrik\",IF(Tabulka3[[#This Row],[Sloupec22]]=FALSE,\" \",\"Chyba\"))","v":" "},{"$f":"IF(Tabulka3[[#This Row],[Sloupec222]]=TRUE,\"Zastrik\",IF(Tabulka3[[#This Row],[Sloupec222]]=FALSE,\" \",\"Chyba\"))","v":" "},{"$f":"IF(Tabulka3[[#This Row],[Sloupec23]]=TRUE,\"Zastrik\",IF(Tabulka3[[#This Row],[Sloupec23]]=FALSE,\" \",\"Chyba\"))","v":" "},null,{"$f":"IF(AO33=\"\",30,AO33)","v":30},{"$f":"IF(Tabulka3[[#This Row],[Sloupec2]],($BB33*C33/1000000)*I33,\"\")","v":""},{"$f":"IF(Tabulka3[[#This Row],[Sloupec22]],($BB33*C33/1000000)*I33,\"\")","v":""},{"$f":"IF(Tabulka3[[#This Row],[Sloupec222]],($BB33*E33/1000000)*I33,\"\")","v":""},{"$f":"IF(Tabulka3[[#This Row],[Sloupec23]],($BB33*E33/1000000)*I33,\"\")","v":""},0,0,0]
["13.",null,null,"",null,"",null,"",null,"",null,null,null,null,null,null,null,null,null,null,{"$f":"IF(I34=\"\",\"\",Tabulka3[[#This Row],[Sloupec64]]+Tabulka3[[#This Row],[Sloupec63]]+BG34)","v":""},"",null,null,{"$f":"IF($I$13=\"ano\",Tabulka3[[#This Row],[Sloupec64]]*100,IF(OR($I$13=\"\",$I$13=\"ne\"),0,\"chyba\"))","v":0},1,false,false,false,false,{"$f":"IF(OR(Tabulka3[[#This Row],[Sloupec2]]=TRUE,Tabulka3[[#This Row],[Sloupec22]]=TRUE,Tabulka3[[#This Row],[Sloupec222]]=TRUE,Tabulka3[[#This Row],[Sloupec23]]=TRUE),1.1,1)","v":1},0,0,0,0,{"$f":"IF(Tabulka3[[#This Row],[Sloupec1]]=1,(C34*E34/1000000)*I34,((C34*E34/1000000)*I34)*2)","v":0},{"$f":"Tabulka3[[#This Row],[Sloupec3]]+Tabulka3[[#This Row],[Sloupec4]]+Tabulka3[[#This Row],[Sloupec5]]+Tabulka3[[#This Row],[Sloupec6]]","v":0},{"$f":"IF($I$12=\"\",0,VLOOKUP($I$12,Pomocné!C:E,2,FALSE))","v":1600},{"$f":"IF(Tabulka3[[#This Row],[Sloupec1]]=1,VLOOKUP($I$12,Tabulka1[],2,FALSE),VLOOKUP($I$12,Tabulka1[],3,FALSE))","v":1600},{"$f":"IF(U34=\"\",0,IF(Tabulka3[[#This Row],[Sloupec24]]=1,Tabulka3[[#This Row],[Sloupec64]]*Tabulka3[[#This Row],[Sloupec62]]+Tabulka3[[#This Row],[Sloupec63]]*Tabulka3[[#This Row],[Sloupec632]]+Y34,(Tabulka3[[#This Row],[Sloupec64]]*Tabulka3[[#This Row],[Sloupec62]]*Tabulka3[[#This Row],[Sloupec24]])+Tabulka3[[#This Row],[Sloupec63]]*Tabulka3[[#This Row],[Sloupec632]]+Y34))","v":0},null,"","","","lesk","ne","",{"$f":"IF(Tabulka3[[#This Row],[Sloupec1]]=1,\"Jednostranne\",IF(Tabulka3[[#This Row],[Sloupec1]]=2,\"Oboustranne\",\"Nezadano\"))","v":"Jednostranne"},{"$f":"IF(Tabulka3[[#This Row],[Sloupec2]]=TRUE,\"Zastrik\",IF(Tabulka3[[#This Row],[Sloupec2]]=FALSE,\" \",\"Chyba\"))","v":" "},{"$f":"IF(Tabulka3[[#This Row],[Sloupec22]]=TRUE,\"Zastrik\",IF(Tabulka3[[#This Row],[Sloupec22]]=FALSE,\" \",\"Chyba\"))","v":" "},{"$f":"IF(Tabulka3[[#This Row],[Sloupec222]]=TRUE,\"Zastrik\",IF(Tabulka3[[#This Row],[Sloupec222]]=FALSE,\" \",\"Chyba\"))","v":" "},{"$f":"IF(Tabulka3[[#This Row],[Sloupec23]]=TRUE,\"Zastrik\",IF(Tabulka3[[#This Row],[Sloupec23]]=FALSE,\" \",\"Chyba\"))","v":" "},null,{"$f":"IF(AO34=\"\",30,AO34)","v":30},{"$f":"IF(Tabulka3[[#This Row],[Sloupec2]],($BB34*C34/1000000)*I34,\"\")","v":""},{"$f":"IF(Tabulka3[[#This Row],[Sloupec22]],($BB34*C34/1000000)*I34,\"\")","v":""},{"$f":"IF(Tabulka3[[#This Row],[Sloupec222]],($BB34*E34/1000000)*I34,\"\")","v":""},{"$f":"IF(Tabulka3[[#This Row],[Sloupec23]],($BB34*E34/1000000)*I34,\"\")","v":""},0,0,0]
["14.",null,null,"",null,"",null,"",null,"",null,null,null,null,null,null,null,null,null,null,{"$f":"IF(I35=\"\",\"\",Tabulka3[[#This Row],[Sloupec64]]+Tabulka3[[#This Row],[Sloupec63]]+BG35)","v":""},"",null,null,{"$f":"IF($I$13=\"ano\",Tabulka3[[#This Row],[Sloupec64]]*100,IF(OR($I$13=\"\",$I$13=\"ne\"),0,\"chyba\"))","v":0},1,false,false,false,false,{"$f":"IF(OR(Tabulka3[[#This Row],[Sloupec2]]=TRUE,Tabulka3[[#This Row],[Sloupec22]]=TRUE,Tabulka3[[#This Row],[Sloupec222]]=TRUE,Tabulka3[[#This Row],[Sloupec23]]=TRUE),1.1,1)","v":1},0,0,0,0,{"$f":"IF(Tabulka3[[#This Row],[Sloupec1]]=1,(C35*E35/1000000)*I35,((C35*E35/1000000)*I35)*2)","v":0},{"$f":"Tabulka3[[#This Row],[Sloupec3]]+Tabulka3[[#This Row],[Sloupec4]]+Tabulka3[[#This Row],[Sloupec5]]+Tabulka3[[#This Row],[Sloupec6]]","v":0},{"$f":"IF($I$12=\"\",0,VLOOKUP($I$12,Pomocné!C:E,2,FALSE))","v":1600},{"$f":"IF(Tabulka3[[#This Row],[Sloupec1]]=1,VLOOKUP($I$12,Tabulka1[],2,FALSE),VLOOKUP($I$12,Tabulka1[],3,FALSE))","v":1600},{"$f":"IF(U35=\"\",0,IF(Tabulka3[[#This Row],[Sloupec24]]=1,Tabulka3[[#This Row],[Sloupec64]]*Tabulka3[[#This Row],[Sloupec62]]+Tabulka3[[#This Row],[Sloupec63]]*Tabulka3[[#This Row],[Sloupec632]]+Y35,(Tabulka3[[#This Row],[Sloupec64]]*Tabulka3[[#This Row],[Sloupec62]]*Tabulka3[[#This Row],[Sloupec24]])+Tabulka3[[#This Row],[Sloupec63]]*Tabulka3[[#This Row],[Sloupec632]]+Y35))","v":0},null,"","","","lesk","ne","",{"$f":"IF(Tabulka3[[#This Row],[Sloupec1]]=1,\"Jednostranne\",IF(Tabulka3[[#This Row],[Sloupec1]]=2,\"Oboustranne\",\"Nezadano\"))","v":"Jednostranne"},{"$f":"IF(Tabulka3[[#This Row],[Sloupec2]]=TRUE,\"Zastrik\",IF(Tabulka3[[#This Row],[Sloupec2]]=FALSE,\" \",\"Chyba\"))","v":" "},{"$f":"IF(Tabulka3[[#This Row],[Sloupec22]]=TRUE,\"Zastrik\",IF(Tabulka3[[#This Row],[Sloupec22]]=FALSE,\" \",\"Chyba\"))","v":" "},{"$f":"IF(Tabulka3[[#This Row],[Sloupec222]]=TRUE,\"Zastrik\",IF(Tabulka3[[#This Row],[Sloupec222]]=FALSE,\" \",\"Chyba\"))","v":" "},{"$f":"IF(Tabulka3[[#This Row],[Sloupec23]]=TRUE,\"Zastrik\",IF(Tabulka3[[#This Row],[Sloupec23]]=FALSE,\" \",\"Chyba\"))","v":" "},null,{"$f":"IF(AO35=\"\",30,AO35)","v":30},{"$f":"IF(Tabulka3[[#This Row],[Sloupec2]],($BB35*C35/1000000)*I35,\"\")","v":""},{"$f":"IF(Tabulka3[[#This Row],[Sloupec22]],($BB35*C35/1000000)*I35,\"\")","v":""},{"$f":"IF(Tabulka3[[#This Row],[Sloupec222]],($BB35*E35/1000000)*I35,\"\")","v":""},{"$f":"IF(Tabulka3[[#This Row],[Sloupec23]],($BB35*E35/1000000)*I35,\"\")","v":""},0,0,0]
["15.",null,null,"",null,"",null,"",null,"",null,null,null,null,null,null,null,null,null,null,{"$f":"IF(I36=\"\",\"\",Tabulka3[[#This Row],[Sloupec64]]+Tabulka3[[#This Row],[Sloupec63]]+BG36)","v":""},"",null,null,{"$f":"IF($I$13=\"ano\",Tabulka3[[#This Row],[Sloupec64]]*100,IF(OR($I$13=\"\",$I$13=\"ne\"),0,\"chyba\"))","v":0},1,false,false,false,false,{"$f":"IF(OR(Tabulka3[[#This Row],[Sloupec2]]=TRUE,Tabulka3[[#This Row],[Sloupec22]]=TRUE,Tabulka3[[#This Row],[Sloupec222]]=TRUE,Tabulka3[[#This Row],[Sloupec23]]=TRUE),1.1,1)","v":1},0,0,0,0,{"$f":"IF(Tabulka3[[#This Row],[Sloupec1]]=1,(C36*E36/1000000)*I36,((C36*E36/1000000)*I36)*2)","v":0},{"$f":"Tabulka3[[#This Row],[Sloupec3]]+Tabulka3[[#This Row],[Sloupec4]]+Tabulka3[[#This Row],[Sloupec5]]+Tabulka3[[#This Row],[Sloupec6]]","v":0},{"$f":"IF($I$12=\"\",0,VLOOKUP($I$12,Pomocné!C:E,2,FALSE))","v":1600},{"$f":"IF(Tabulka3[[#This Row],[Sloupec1]]=1,VLOOKUP($I$12,Tabulka1[],2,FALSE),VLOOKUP($I$12,Tabulka1[],3,FALSE))","v":1600},{"$f":"IF(U36=\"\",0,IF(Tabulka3[[#This Row],[Sloupec24]]=1,Tabulka3[[#This Row],[Sloupec64]]*Tabulka3[[#This Row],[Sloupec62]]+Tabulka3[[#This Row],[Sloupec63]]*Tabulka3[[#This Row],[Sloupec632]]+Y36,(Tabulka3[[#This Row],[Sloupec64]]*Tabulka3[[#This Row],[Sloupec62]]*Tabulka3[[#This Row],[Sloupec24]])+Tabulka3[[#This Row],[Sloupec63]]*Tabulka3[[#This Row],[Sloupec632]]+Y36))","v":0},null,"","","","lesk","ne","",{"$f":"IF(Tabulka3[[#This Row],[Sloupec1]]=1,\"Jednostranne\",IF(Tabulka3[[#This Row],[Sloupec1]]=2,\"Oboustranne\",\"Nezadano\"))","v":"Jednostranne"},{"$f":"IF(Tabulka3[[#This Row],[Sloupec2]]=TRUE,\"Zastrik\",IF(Tabulka3[[#This Row],[Sloupec2]]=FALSE,\" \",\"Chyba\"))","v":" "},{"$f":"IF(Tabulka3[[#This Row],[Sloupec22]]=TRUE,\"Zastrik\",IF(Tabulka3[[#This Row],[Sloupec22]]=FALSE,\" \",\"Chyba\"))","v":" "},{"$f":"IF(Tabulka3[[#This Row],[Sloupec222]]=TRUE,\"Zastrik\",IF(Tabulka3[[#This Row],[Sloupec222]]=FALSE,\" \",\"Chyba\"))","v":" "},{"$f":"IF(Tabulka3[[#This Row],[Sloupec23]]=TRUE,\"Zastrik\",IF(Tabulka3[[#This Row],[Sloupec23]]=FALSE,\" \",\"Chyba\"))","v":" "},null,{"$f":"IF(AO36=\"\",30,AO36)","v":30},{"$f":"IF(Tabulka3[[#This Row],[Sloupec2]],($BB36*C36/1000000)*I36,\"\")","v":""},{"$f":"IF(Tabulka3[[#This Row],[Sloupec22]],($BB36*C36/1000000)*I36,\"\")","v":""},{"$f":"IF(Tabulka3[[#This Row],[Sloupec222]],($BB36*E36/1000000)*I36,\"\")","v":""},{"$f":"IF(Tabulka3[[#This Row],[Sloupec23]],($BB36*E36/1000000)*I36,\"\")","v":""},0,0,0]
["16.",null,null,"",null,"",null,"",null,"",null,null,null,null,null,null,null,null,null,null,{"$f":"IF(I37=\"\",\"\",Tabulka3[[#This Row],[Sloupec64]]+Tabulka3[[#This Row],[Sloupec63]]+BG37)","v":""},"",null,null,{"$f":"IF($I$13=\"ano\",Tabulka3[[#This Row],[Sloupec64]]*100,IF(OR($I$13=\"\",$I$13=\"ne\"),0,\"chyba\"))","v":0},1,false,false,false,false,{"$f":"IF(OR(Tabulka3[[#This Row],[Sloupec2]]=TRUE,Tabulka3[[#This Row],[Sloupec22]]=TRUE,Tabulka3[[#This Row],[Sloupec222]]=TRUE,Tabulka3[[#This Row],[Sloupec23]]=TRUE),1.1,1)","v":1},0,0,0,0,{"$f":"IF(Tabulka3[[#This Row],[Sloupec1]]=1,(C37*E37/1000000)*I37,((C37*E37/1000000)*I37)*2)","v":0},{"$f":"Tabulka3[[#This Row],[Sloupec3]]+Tabulka3[[#This Row],[Sloupec4]]+Tabulka3[[#This Row],[Sloupec5]]+Tabulka3[[#This Row],[Sloupec6]]","v":0},{"$f":"IF($I$12=\"\",0,VLOOKUP($I$12,Pomocné!C:E,2,FALSE))","v":1600},{"$f":"IF(Tabulka3[[#This Row],[Sloupec1]]=1,VLOOKUP($I$12,Tabulka1[],2,FALSE),VLOOKUP($I$12,Tabulka1[],3,FALSE))","v":1600},{"$f":"IF(U37=\"\",0,IF(Tabulka3[[#This Row],[Sloupec24]]=1,Tabulka3[[#This Row],[Sloupec64]]*Tabulka3[[#This Row],[Sloupec62]]+Tabulka3[[#This Row],[Sloupec63]]*Tabulka3[[#This Row],[Sloupec632]]+Y37,(Tabulka3[[#This Row],[Sloupec64]]*Tabulka3[[#This Row],[Sloupec62]]*Tabulka3[[#This Row],[Sloupec24]])+Tabulka3[[#This Row],[Sloupec63]]*Tabulka3[[#This Row],[Sloupec632]]+Y37))","v":0},null,"","","","lesk","ne","",{"$f":"IF(Tabulka3[[#This Row],[Sloupec1]]=1,\"Jednostranne\",IF(Tabulka3[[#This Row],[Sloupec1]]=2,\"Oboustranne\",\"Nezadano\"))","v":"Jednostranne"},{"$f":"IF(Tabulka3[[#This Row],[Sloupec2]]=TRUE,\"Zastrik\",IF(Tabulka3[[#This Row],[Sloupec2]]=FALSE,\" \",\"Chyba\"))","v":" "},{"$f":"IF(Tabulka3[[#This Row],[Sloupec22]]=TRUE,\"Zastrik\",IF(Tabulka3[[#This Row],[Sloupec22]]=FALSE,\" \",\"Chyba\"))","v":" "},{"$f":"IF(Tabulka3[[#This Row],[Sloupec222]]=TRUE,\"Zastrik\",IF(Tabulka3[[#This Row],[Sloupec222]]=FALSE,\" \",\"Chyba\"))","v":" "},{"$f":"IF(Tabulka3[[#This Row],[Sloupec23]]=TRUE,\"Zastrik\",IF(Tabulka3[[#This Row],[Sloupec23]]=FALSE,\" \",\"Chyba\"))","v":" "},null,{"$f":"IF(AO37=\"\",30,AO37)","v":30},{"$f":"IF(Tabulka3[[#This Row],[Sloupec2]],($BB37*C37/1000000)*I37,\"\")","v":""},{"$f":"IF(Tabulka3[[#This Row],[Sloupec22]],($BB37*C37/1000000)*I37,\"\")","v":""},{"$f":"IF(Tabulka3[[#This Row],[Sloupec222]],($BB37*E37/1000000)*I37,\"\")","v":""},{"$f":"IF(Tabulka3[[#This Row],[Sloupec23]],($BB37*E37/1000000)*I37,\"\")","v":""},0,0,0]
["17.",null,null,"",null,"",null,"",null,"",null,null,null,null,null,null,null,null,null,null,{"$f":"IF(I38=\"\",\"\",Tabulka3[[#This Row],[Sloupec64]]+Tabulka3[[#This Row],[Sloupec63]]+BG38)","v":""},"",null,null,{"$f":"IF($I$13=\"ano\",Tabulka3[[#This Row],[Sloupec64]]*100,IF(OR($I$13=\"\",$I$13=\"ne\"),0,\"chyba\"))","v":0},1,false,false,false,false,{"$f":"IF(OR(Tabulka3[[#This Row],[Sloupec2]]=TRUE,Tabulka3[[#This Row],[Sloupec22]]=TRUE,Tabulka3[[#This Row],[Sloupec222]]=TRUE,Tabulka3[[#This Row],[Sloupec23]]=TRUE),1.1,1)","v":1},0,0,0,0,{"$f":"IF(Tabulka3[[#This Row],[Sloupec1]]=1,(C38*E38/1000000)*I38,((C38*E38/1000000)*I38)*2)","v":0},{"$f":"Tabulka3[[#This Row],[Sloupec3]]+Tabulka3[[#This Row],[Sloupec4]]+Tabulka3[[#This Row],[Sloupec5]]+Tabulka3[[#This Row],[Sloupec6]]","v":0},{"$f":"IF($I$12=\"\",0,VLOOKUP($I$12,Pomocné!C:E,2,FALSE))","v":1600},{"$f":"IF(Tabulka3[[#This Row],[Sloupec1]]=1,VLOOKUP($I$12,Tabulka1[],2,FALSE),VLOOKUP($I$12,Tabulka1[],3,FALSE))","v":1600},{"$f":"IF(U38=\"\",0,IF(Tabulka3[[#This Row],[Sloupec24]]=1,Tabulka3[[#This Row],[Sloupec64]]*Tabulka3[[#This Row],[Sloupec62]]+Tabulka3[[#This Row],[Sloupec63]]*Tabulka3[[#This Row],[Sloupec632]]+Y38,(Tabulka3[[#This Row],[Sloupec64]]*Tabulka3[[#This Row],[Sloupec62]]*Tabulka3[[#This Row],[Sloupec24]])+Tabulka3[[#This Row],[Sloupec63]]*Tabulka3[[#This Row],[Sloupec632]]+Y38))","v":0},null,"","","","lesk","ne","",{"$f":"IF(Tabulka3[[#This Row],[Sloupec1]]=1,\"Jednostranne\",IF(Tabulka3[[#This Row],[Sloupec1]]=2,\"Oboustranne\",\"Nezadano\"))","v":"Jednostranne"},{"$f":"IF(Tabulka3[[#This Row],[Sloupec2]]=TRUE,\"Zastrik\",IF(Tabulka3[[#This Row],[Sloupec2]]=FALSE,\" \",\"Chyba\"))","v":" "},{"$f":"IF(Tabulka3[[#This Row],[Sloupec22]]=TRUE,\"Zastrik\",IF(Tabulka3[[#This Row],[Sloupec22]]=FALSE,\" \",\"Chyba\"))","v":" "},{"$f":"IF(Tabulka3[[#This Row],[Sloupec222]]=TRUE,\"Zastrik\",IF(Tabulka3[[#This Row],[Sloupec222]]=FALSE,\" \",\"Chyba\"))","v":" "},{"$f":"IF(Tabulka3[[#This Row],[Sloupec23]]=TRUE,\"Zastrik\",IF(Tabulka3[[#This Row],[Sloupec23]]=FALSE,\" \",\"Chyba\"))","v":" "},null,{"$f":"IF(AO38=\"\",30,AO38)","v":30},{"$f":"IF(Tabulka3[[#This Row],[Sloupec2]],($BB38*C38/1000000)*I38,\"\")","v":""},{"$f":"IF(Tabulka3[[#This Row],[Sloupec22]],($BB38*C38/1000000)*I38,\"\")","v":""},{"$f":"IF(Tabulka3[[#This Row],[Sloupec222]],($BB38*E38/1000000)*I38,\"\")","v":""},{"$f":"IF(Tabulka3[[#This Row],[Sloupec23]],($BB38*E38/1000000)*I38,\"\")","v":""},0,0,0]
["18.",null,null,"",null,"",null,"",null,"",null,null,null,null,null,null,null,null,null,null,{"$f":"IF(I39=\"\",\"\",Tabulka3[[#This Row],[Sloupec64]]+Tabulka3[[#This Row],[Sloupec63]]+BG39)","v":""},"",null,null,{"$f":"IF($I$13=\"ano\",Tabulka3[[#This Row],[Sloupec64]]*100,IF(OR($I$13=\"\",$I$13=\"ne\"),0,\"chyba\"))","v":0},1,false,false,false,false,{"$f":"IF(OR(Tabulka3[[#This Row],[Sloupec2]]=TRUE,Tabulka3[[#This Row],[Sloupec22]]=TRUE,Tabulka3[[#This Row],[Sloupec222]]=TRUE,Tabulka3[[#This Row],[Sloupec23]]=TRUE),1.1,1)","v":1},0,0,0,0,{"$f":"IF(Tabulka3[[#This Row],[Sloupec1]]=1,(C39*E39/1000000)*I39,((C39*E39/1000000)*I39)*2)","v":0},{"$f":"Tabulka3[[#This Row],[Sloupec3]]+Tabulka3[[#This Row],[Sloupec4]]+Tabulka3[[#This Row],[Sloupec5]]+Tabulka3[[#This Row],[Sloupec6]]","v":0},{"$f":"IF($I$12=\"\",0,VLOOKUP($I$12,Pomocné!C:E,2,FALSE))","v":1600},{"$f":"IF(Tabulka3[[#This Row],[Sloupec1]]=1,VLOOKUP($I$12,Tabulka1[],2,FALSE),VLOOKUP($I$12,Tabulka1[],3,FALSE))","v":1600},{"$f":"IF(U39=\"\",0,IF(Tabulka3[[#This Row],[Sloupec24]]=1,Tabulka3[[#This Row],[Sloupec64]]*Tabulka3[[#This Row],[Sloupec62]]+Tabulka3[[#This Row],[Sloupec63]]*Tabulka3[[#This Row],[Sloupec632]]+Y39,(Tabulka3[[#This Row],[Sloupec64]]*Tabulka3[[#This Row],[Sloupec62]]*Tabulka3[[#This Row],[Sloupec24]])+Tabulka3[[#This Row],[Sloupec63]]*Tabulka3[[#This Row],[Sloupec632]]+Y39))","v":0},null,"","","","lesk","ne","",{"$f":"IF(Tabulka3[[#This Row],[Sloupec1]]=1,\"Jednostranne\",IF(Tabulka3[[#This Row],[Sloupec1]]=2,\"Oboustranne\",\"Nezadano\"))","v":"Jednostranne"},{"$f":"IF(Tabulka3[[#This Row],[Sloupec2]]=TRUE,\"Zastrik\",IF(Tabulka3[[#This Row],[Sloupec2]]=FALSE,\" \",\"Chyba\"))","v":" "},{"$f":"IF(Tabulka3[[#This Row],[Sloupec22]]=TRUE,\"Zastrik\",IF(Tabulka3[[#This Row],[Sloupec22]]=FALSE,\" \",\"Chyba\"))","v":" "},{"$f":"IF(Tabulka3[[#This Row],[Sloupec222]]=TRUE,\"Zastrik\",IF(Tabulka3[[#This Row],[Sloupec222]]=FALSE,\" \",\"Chyba\"))","v":" "},{"$f":"IF(Tabulka3[[#This Row],[Sloupec23]]=TRUE,\"Zastrik\",IF(Tabulka3[[#This Row],[Sloupec23]]=FALSE,\" \",\"Chyba\"))","v":" "},null,{"$f":"IF(AO39=\"\",30,AO39)","v":30},{"$f":"IF(Tabulka3[[#This Row],[Sloupec2]],($BB39*C39/1000000)*I39,\"\")","v":""},{"$f":"IF(Tabulka3[[#This Row],[Sloupec22]],($BB39*C39/1000000)*I39,\"\")","v":""},{"$f":"IF(Tabulka3[[#This Row],[Sloupec222]],($BB39*E39/1000000)*I39,\"\")","v":""},{"$f":"IF(Tabulka3[[#This Row],[Sloupec23]],($BB39*E39/1000000)*I39,\"\")","v":""},0,0,0]
["19.",null,null,"",null,"",null,"",null,"",null,null,null,null,null,null,null,null,null,null,{"$f":"IF(I40=\"\",\"\",Tabulka3[[#This Row],[Sloupec64]]+Tabulka3[[#This Row],[Sloupec63]]+BG40)","v":""},"",null,null,{"$f":"IF($I$13=\"ano\",Tabulka3[[#This Row],[Sloupec64]]*100,IF(OR($I$13=\"\",$I$13=\"ne\"),0,\"chyba\"))","v":0},1,false,false,false,false,{"$f":"IF(OR(Tabulka3[[#This Row],[Sloupec2]]=TRUE,Tabulka3[[#This Row],[Sloupec22]]=TRUE,Tabulka3[[#This Row],[Sloupec222]]=TRUE,Tabulka3[[#This Row],[Sloupec23]]=TRUE),1.1,1)","v":1},0,0,0,0,{"$f":"IF(Tabulka3[[#This Row],[Sloupec1]]=1,(C40*E40/1000000)*I40,((C40*E40/1000000)*I40)*2)","v":0},{"$f":"Tabulka3[[#This Row],[Sloupec3]]+Tabulka3[[#This Row],[Sloupec4]]+Tabulka3[[#This Row],[Sloupec5]]+Tabulka3[[#This Row],[Sloupec6]]","v":0},{"$f":"IF($I$12=\"\",0,VLOOKUP($I$12,Pomocné!C:E,2,FALSE))","v":1600},{"$f":"IF(Tabulka3[[#This Row],[Sloupec1]]=1,VLOOKUP($I$12,Tabulka1[],2,FALSE),VLOOKUP($I$12,Tabulka1[],3,FALSE))","v":1600},{"$f":"IF(U40=\"\",0,IF(Tabulka3[[#This Row],[Sloupec24]]=1,Tabulka3[[#This Row],[Sloupec64]]*Tabulka3[[#This Row],[Sloupec62]]+Tabulka3[[#This Row],[Sloupec63]]*Tabulka3[[#This Row],[Sloupec632]]+Y40,(Tabulka3[[#This Row],[Sloupec64]]*Tabulka3[[#This Row],[Sloupec62]]*Tabulka3[[#This Row],[Sloupec24]])+Tabulka3[[#This Row],[Sloupec63]]*Tabulka3[[#This Row],[Sloupec632]]+Y40))","v":0},null,"","","","lesk","ne","",{"$f":"IF(Tabulka3[[#This Row],[Sloupec1]]=1,\"Jednostranne\",IF(Tabulka3[[#This Row],[Sloupec1]]=2,\"Oboustranne\",\"Nezadano\"))","v":"Jednostranne"},{"$f":"IF(Tabulka3[[#This Row],[Sloupec2]]=TRUE,\"Zastrik\",IF(Tabulka3[[#This Row],[Sloupec2]]=FALSE,\" \",\"Chyba\"))","v":" "},{"$f":"IF(Tabulka3[[#This Row],[Sloupec22]]=TRUE,\"Zastrik\",IF(Tabulka3[[#This Row],[Sloupec22]]=FALSE,\" \",\"Chyba\"))","v":" "},{"$f":"IF(Tabulka3[[#This Row],[Sloupec222]]=TRUE,\"Zastrik\",IF(Tabulka3[[#This Row],[Sloupec222]]=FALSE,\" \",\"Chyba\"))","v":" "},{"$f":"IF(Tabulka3[[#This Row],[Sloupec23]]=TRUE,\"Zastrik\",IF(Tabulka3[[#This Row],[Sloupec23]]=FALSE,\" \",\"Chyba\"))","v":" "},null,{"$f":"IF(AO40=\"\",30,AO40)","v":30},{"$f":"IF(Tabulka3[[#This Row],[Sloupec2]],($BB40*C40/1000000)*I40,\"\")","v":""},{"$f":"IF(Tabulka3[[#This Row],[Sloupec22]],($BB40*C40/1000000)*I40,\"\")","v":""},{"$f":"IF(Tabulka3[[#This Row],[Sloupec222]],($BB40*E40/1000000)*I40,\"\")","v":""},{"$f":"IF(Tabulka3[[#This Row],[Sloupec23]],($BB40*E40/1000000)*I40,\"\")","v":""},0,0,0]
["20.",null,null,"",null,"",null,"",null,"",null,null,null,null,null,null,null,null,null,null,{"$f":"IF(I41=\"\",\"\",Tabulka3[[#This Row],[Sloupec64]]+Tabulka3[[#This Row],[Sloupec63]]+BG41)","v":""},"",null,null,{"$f":"IF($I$13=\"ano\",Tabulka3[[#This Row],[Sloupec64]]*100,IF(OR($I$13=\"\",$I$13=\"ne\"),0,\"chyba\"))","v":0},1,false,false,false,false,{"$f":"IF(OR(Tabulka3[[#This Row],[Sloupec2]]=TRUE,Tabulka3[[#This Row],[Sloupec22]]=TRUE,Tabulka3[[#This Row],[Sloupec222]]=TRUE,Tabulka3[[#This Row],[Sloupec23]]=TRUE),1.1,1)","v":1},0,0,0,0,{"$f":"IF(Tabulka3[[#This Row],[Sloupec1]]=1,(C41*E41/1000000)*I41,((C41*E41/1000000)*I41)*2)","v":0},{"$f":"Tabulka3[[#This Row],[Sloupec3]]+Tabulka3[[#This Row],[Sloupec4]]+Tabulka3[[#This Row],[Sloupec5]]+Tabulka3[[#This Row],[Sloupec6]]","v":0},{"$f":"IF($I$12=\"\",0,VLOOKUP($I$12,Pomocné!C:E,2,FALSE))","v":1600},{"$f":"IF(Tabulka3[[#This Row],[Sloupec1]]=1,VLOOKUP($I$12,Tabulka1[],2,FALSE),VLOOKUP($I$12,Tabulka1[],3,FALSE))","v":1600},{"$f":"IF(U41=\"\",0,IF(Tabulka3[[#This Row],[Sloupec24]]=1,Tabulka3[[#This Row],[Sloupec64]]*Tabulka3[[#This Row],[Sloupec62]]+Tabulka3[[#This Row],[Sloupec63]]*Tabulka3[[#This Row],[Sloupec632]]+Y41,(Tabulka3[[#This Row],[Sloupec64]]*Tabulka3[[#This Row],[Sloupec62]]*Tabulka3[[#This Row],[Sloupec24]])+Tabulka3[[#This Row],[Sloupec63]]*Tabulka3[[#This Row],[Sloupec632]]+Y41))","v":0},null,"","","","lesk","ne","",{"$f":"IF(Tabulka3[[#This Row],[Sloupec1]]=1,\"Jednostranne\",IF(Tabulka3[[#This Row],[Sloupec1]]=2,\"Oboustranne\",\"Nezadano\"))","v":"Jednostranne"},{"$f":"IF(Tabulka3[[#This Row],[Sloupec2]]=TRUE,\"Zastrik\",IF(Tabulka3[[#This Row],[Sloupec2]]=FALSE,\" \",\"Chyba\"))","v":" "},{"$f":"IF(Tabulka3[[#This Row],[Sloupec22]]=TRUE,\"Zastrik\",IF(Tabulka3[[#This Row],[Sloupec22]]=FALSE,\" \",\"Chyba\"))","v":" "},{"$f":"IF(Tabulka3[[#This Row],[Sloupec222]]=TRUE,\"Zastrik\",IF(Tabulka3[[#This Row],[Sloupec222]]=FALSE,\" \",\"Chyba\"))","v":" "},{"$f":"IF(Tabulka3[[#This Row],[Sloupec23]]=TRUE,\"Zastrik\",IF(Tabulka3[[#This Row],[Sloupec23]]=FALSE,\" \",\"Chyba\"))","v":" "},null,{"$f":"IF(AO41=\"\",30,AO41)","v":30},{"$f":"IF(Tabulka3[[#This Row],[Sloupec2]],($BB41*C41/1000000)*I41,\"\")","v":""},{"$f":"IF(Tabulka3[[#This Row],[Sloupec22]],($BB41*C41/1000000)*I41,\"\")","v":""},{"$f":"IF(Tabulka3[[#This Row],[Sloupec222]],($BB41*E41/1000000)*I41,\"\")","v":""},{"$f":"IF(Tabulka3[[#This Row],[Sloupec23]],($BB41*E41/1000000)*I41,\"\")","v":""},0,0,0]
["21.",null,null,"",null,"",null,"",null,"",null,null,null,null,null,null,null,null,null,null,{"$f":"IF(I42=\"\",\"\",Tabulka3[[#This Row],[Sloupec64]]+Tabulka3[[#This Row],[Sloupec63]]+BG42)","v":""},"",null,null,{"$f":"IF($I$13=\"ano\",Tabulka3[[#This Row],[Sloupec64]]*100,IF(OR($I$13=\"\",$I$13=\"ne\"),0,\"chyba\"))","v":0},1,false,false,false,false,{"$f":"IF(OR(Tabulka3[[#This Row],[Sloupec2]]=TRUE,Tabulka3[[#This Row],[Sloupec22]]=TRUE,Tabulka3[[#This Row],[Sloupec222]]=TRUE,Tabulka3[[#This Row],[Sloupec23]]=TRUE),1.1,1)","v":1},0,0,0,0,{"$f":"IF(Tabulka3[[#This Row],[Sloupec1]]=1,(C42*E42/1000000)*I42,((C42*E42/1000000)*I42)*2)","v":0},{"$f":"Tabulka3[[#This Row],[Sloupec3]]+Tabulka3[[#This Row],[Sloupec4]]+Tabulka3[[#This Row],[Sloupec5]]+Tabulka3[[#This Row],[Sloupec6]]","v":0},{"$f":"IF($I$12=\"\",0,VLOOKUP($I$12,Pomocné!C:E,2,FALSE))","v":1600},{"$f":"IF(Tabulka3[[#This Row],[Sloupec1]]=1,VLOOKUP($I$12,Tabulka1[],2,FALSE),VLOOKUP($I$12,Tabulka1[],3,FALSE))","v":1600},{"$f":"IF(U42=\"\",0,IF(Tabulka3[[#This Row],[Sloupec24]]=1,Tabulka3[[#This Row],[Sloupec64]]*Tabulka3[[#This Row],[Sloupec62]]+Tabulka3[[#This Row],[Sloupec63]]*Tabulka3[[#This Row],[Sloupec632]]+Y42,(Tabulka3[[#This Row],[Sloupec64]]*Tabulka3[[#This Row],[Sloupec62]]*Tabulka3[[#This Row],[Sloupec24]])+Tabulka3[[#This Row],[Sloupec63]]*Tabulka3[[#This Row],[Sloupec632]]+Y42))","v":0},null,"","","","lesk","ne","",{"$f":"IF(Tabulka3[[#This Row],[Sloupec1]]=1,\"Jednostranne\",IF(Tabulka3[[#This Row],[Sloupec1]]=2,\"Oboustranne\",\"Nezadano\"))","v":"Jednostranne"},{"$f":"IF(Tabulka3[[#This Row],[Sloupec2]]=TRUE,\"Zastrik\",IF(Tabulka3[[#This Row],[Sloupec2]]=FALSE,\" \",\"Chyba\"))","v":" "},{"$f":"IF(Tabulka3[[#This Row],[Sloupec22]]=TRUE,\"Zastrik\",IF(Tabulka3[[#This Row],[Sloupec22]]=FALSE,\" \",\"Chyba\"))","v":" "},{"$f":"IF(Tabulka3[[#This Row],[Sloupec222]]=TRUE,\"Zastrik\",IF(Tabulka3[[#This Row],[Sloupec222]]=FALSE,\" \",\"Chyba\"))","v":" "},{"$f":"IF(Tabulka3[[#This Row],[Sloupec23]]=TRUE,\"Zastrik\",IF(Tabulka3[[#This Row],[Sloupec23]]=FALSE,\" \",\"Chyba\"))","v":" "},null,{"$f":"IF(AO42=\"\",30,AO42)","v":30},{"$f":"IF(Tabulka3[[#This Row],[Sloupec2]],($BB42*C42/1000000)*I42,\"\")","v":""},{"$f":"IF(Tabulka3[[#This Row],[Sloupec22]],($BB42*C42/1000000)*I42,\"\")","v":""},{"$f":"IF(Tabulka3[[#This Row],[Sloupec222]],($BB42*E42/1000000)*I42,\"\")","v":""},{"$f":"IF(Tabulka3[[#This Row],[Sloupec23]],($BB42*E42/1000000)*I42,\"\")","v":""},0,0,0]
["22.",null,null,"",null,"",null,"",null,"",null,null,null,null,null,null,null,null,null,null,{"$f":"IF(I43=\"\",\"\",Tabulka3[[#This Row],[Sloupec64]]+Tabulka3[[#This Row],[Sloupec63]]+BG43)","v":""},"",null,null,{"$f":"IF($I$13=\"ano\",Tabulka3[[#This Row],[Sloupec64]]*100,IF(OR($I$13=\"\",$I$13=\"ne\"),0,\"chyba\"))","v":0},1,false,false,false,false,{"$f":"IF(OR(Tabulka3[[#This Row],[Sloupec2]]=TRUE,Tabulka3[[#This Row],[Sloupec22]]=TRUE,Tabulka3[[#This Row],[Sloupec222]]=TRUE,Tabulka3[[#This Row],[Sloupec23]]=TRUE),1.1,1)","v":1},0,0,0,0,{"$f":"IF(Tabulka3[[#This Row],[Sloupec1]]=1,(C43*E43/1000000)*I43,((C43*E43/1000000)*I43)*2)","v":0},{"$f":"Tabulka3[[#This Row],[Sloupec3]]+Tabulka3[[#This Row],[Sloupec4]]+Tabulka3[[#This Row],[Sloupec5]]+Tabulka3[[#This Row],[Sloupec6]]","v":0},{"$f":"IF($I$12=\"\",0,VLOOKUP($I$12,Pomocné!C:E,2,FALSE))","v":1600},{"$f":"IF(Tabulka3[[#This Row],[Sloupec1]]=1,VLOOKUP($I$12,Tabulka1[],2,FALSE),VLOOKUP($I$12,Tabulka1[],3,FALSE))","v":1600},{"$f":"IF(U43=\"\",0,IF(Tabulka3[[#This Row],[Sloupec24]]=1,Tabulka3[[#This Row],[Sloupec64]]*Tabulka3[[#This Row],[Sloupec62]]+Tabulka3[[#This Row],[Sloupec63]]*Tabulka3[[#This Row],[Sloupec632]]+Y43,(Tabulka3[[#This Row],[Sloupec64]]*Tabulka3[[#This Row],[Sloupec62]]*Tabulka3[[#This Row],[Sloupec24]])+Tabulka3[[#This Row],[Sloupec63]]*Tabulka3[[#This Row],[Sloupec632]]+Y43))","v":0},null,"","","","lesk","ne","",{"$f":"IF(Tabulka3[[#This Row],[Sloupec1]]=1,\"Jednostranne\",IF(Tabulka3[[#This Row],[Sloupec1]]=2,\"Oboustranne\",\"Nezadano\"))","v":"Jednostranne"},{"$f":"IF(Tabulka3[[#This Row],[Sloupec2]]=TRUE,\"Zastrik\",IF(Tabulka3[[#This Row],[Sloupec2]]=FALSE,\" \",\"Chyba\"))","v":" "},{"$f":"IF(Tabulka3[[#This Row],[Sloupec22]]=TRUE,\"Zastrik\",IF(Tabulka3[[#This Row],[Sloupec22]]=FALSE,\" \",\"Chyba\"))","v":" "},{"$f":"IF(Tabulka3[[#This Row],[Sloupec222]]=TRUE,\"Zastrik\",IF(Tabulka3[[#This Row],[Sloupec222]]=FALSE,\" \",\"Chyba\"))","v":" "},{"$f":"IF(Tabulka3[[#This Row],[Sloupec23]]=TRUE,\"Zastrik\",IF(Tabulka3[[#This Row],[Sloupec23]]=FALSE,\" \",\"Chyba\"))","v":" "},null,{"$f":"IF(AO43=\"\",30,AO43)","v":30},{"$f":"IF(Tabulka3[[#This Row],[Sloupec2]],($BB43*C43/1000000)*I43,\"\")","v":""},{"$f":"IF(Tabulka3[[#This Row],[Sloupec22]],($BB43*C43/1000000)*I43,\"\")","v":""},{"$f":"IF(Tabulka3[[#This Row],[Sloupec222]],($BB43*E43/1000000)*I43,\"\")","v":""},{"$f":"IF(Tabulka3[[#This Row],[Sloupec23]],($BB43*E43/1000000)*I43,\"\")","v":""},0,0,0]
["23.",null,null,"",null,"",null,"",null,"",null,null,null,null,null,null,null,null,null,null,{"$f":"IF(I44=\"\",\"\",Tabulka3[[#This Row],[Sloupec64]]+Tabulka3[[#This Row],[Sloupec63]]+BG44)","v":""},"",null,null,{"$f":"IF($I$13=\"ano\",Tabulka3[[#This Row],[Sloupec64]]*100,IF(OR($I$13=\"\",$I$13=\"ne\"),0,\"chyba\"))","v":0},1,false,false,false,false,{"$f":"IF(OR(Tabulka3[[#This Row],[Sloupec2]]=TRUE,Tabulka3[[#This Row],[Sloupec22]]=TRUE,Tabulka3[[#This Row],[Sloupec222]]=TRUE,Tabulka3[[#This Row],[Sloupec23]]=TRUE),1.1,1)","v":1},0,0,0,0,{"$f":"IF(Tabulka3[[#This Row],[Sloupec1]]=1,(C44*E44/1000000)*I44,((C44*E44/1000000)*I44)*2)","v":0},{"$f":"Tabulka3[[#This Row],[Sloupec3]]+Tabulka3[[#This Row],[Sloupec4]]+Tabulka3[[#This Row],[Sloupec5]]+Tabulka3[[#This Row],[Sloupec6]]","v":0},{"$f":"IF($I$12=\"\",0,VLOOKUP($I$12,Pomocné!C:E,2,FALSE))","v":1600},{"$f":"IF(Tabulka3[[#This Row],[Sloupec1]]=1,VLOOKUP($I$12,Tabulka1[],2,FALSE),VLOOKUP($I$12,Tabulka1[],3,FALSE))","v":1600},{"$f":"IF(U44=\"\",0,IF(Tabulka3[[#This Row],[Sloupec24]]=1,Tabulka3[[#This Row],[Sloupec64]]*Tabulka3[[#This Row],[Sloupec62]]+Tabulka3[[#This Row],[Sloupec63]]*Tabulka3[[#This Row],[Sloupec632]]+Y44,(Tabulka3[[#This Row],[Sloupec64]]*Tabulka3[[#This Row],[Sloupec62]]*Tabulka3[[#This Row],[Sloupec24]])+Tabulka3[[#This Row],[Sloupec63]]*Tabulka3[[#This Row],[Sloupec632]]+Y44))","v":0},null,"","","","lesk","ne","",{"$f":"IF(Tabulka3[[#This Row],[Sloupec1]]=1,\"Jednostranne\",IF(Tabulka3[[#This Row],[Sloupec1]]=2,\"Oboustranne\",\"Nezadano\"))","v":"Jednostranne"},{"$f":"IF(Tabulka3[[#This Row],[Sloupec2]]=TRUE,\"Zastrik\",IF(Tabulka3[[#This Row],[Sloupec2]]=FALSE,\" \",\"Chyba\"))","v":" "},{"$f":"IF(Tabulka3[[#This Row],[Sloupec22]]=TRUE,\"Zastrik\",IF(Tabulka3[[#This Row],[Sloupec22]]=FALSE,\" \",\"Chyba\"))","v":" "},{"$f":"IF(Tabulka3[[#This Row],[Sloupec222]]=TRUE,\"Zastrik\",IF(Tabulka3[[#This Row],[Sloupec222]]=FALSE,\" \",\"Chyba\"))","v":" "},{"$f":"IF(Tabulka3[[#This Row],[Sloupec23]]=TRUE,\"Zastrik\",IF(Tabulka3[[#This Row],[Sloupec23]]=FALSE,\" \",\"Chyba\"))","v":" "},null,{"$f":"IF(AO44=\"\",30,AO44)","v":30},{"$f":"IF(Tabulka3[[#This Row],[Sloupec2]],($BB44*C44/1000000)*I44,\"\")","v":""},{"$f":"IF(Tabulka3[[#This Row],[Sloupec22]],($BB44*C44/1000000)*I44,\"\")","v":""},{"$f":"IF(Tabulka3[[#This Row],[Sloupec222]],($BB44*E44/1000000)*I44,\"\")","v":""},{"$f":"IF(Tabulka3[[#This Row],[Sloupec23]],($BB44*E44/1000000)*I44,\"\")","v":""},0,0,0]
["24.",null,null,"",null,"",null,"",null,"",null,null,null,null,null,null,null,null,null,null,{"$f":"IF(I45=\"\",\"\",Tabulka3[[#This Row],[Sloupec64]]+Tabulka3[[#This Row],[Sloupec63]]+BG45)","v":""},"",null,null,{"$f":"IF($I$13=\"ano\",Tabulka3[[#This Row],[Sloupec64]]*100,IF(OR($I$13=\"\",$I$13=\"ne\"),0,\"chyba\"))","v":0},1,false,false,false,false,{"$f":"IF(OR(Tabulka3[[#This Row],[Sloupec2]]=TRUE,Tabulka3[[#This Row],[Sloupec22]]=TRUE,Tabulka3[[#This Row],[Sloupec222]]=TRUE,Tabulka3[[#This Row],[Sloupec23]]=TRUE),1.1,1)","v":1},0,0,0,0,{"$f":"IF(Tabulka3[[#This Row],[Sloupec1]]=1,(C45*E45/1000000)*I45,((C45*E45/1000000)*I45)*2)","v":0},{"$f":"Tabulka3[[#This Row],[Sloupec3]]+Tabulka3[[#This Row],[Sloupec4]]+Tabulka3[[#This Row],[Sloupec5]]+Tabulka3[[#This Row],[Sloupec6]]","v":0},{"$f":"IF($I$12=\"\",0,VLOOKUP($I$12,Pomocné!C:E,2,FALSE))","v":1600},{"$f":"IF(Tabulka3[[#This Row],[Sloupec1]]=1,VLOOKUP($I$12,Tabulka1[],2,FALSE),VLOOKUP($I$12,Tabulka1[],3,FALSE))","v":1600},{"$f":"IF(U45=\"\",0,IF(Tabulka3[[#This Row],[Sloupec24]]=1,Tabulka3[[#This Row],[Sloupec64]]*Tabulka3[[#This Row],[Sloupec62]]+Tabulka3[[#This Row],[Sloupec63]]*Tabulka3[[#This Row],[Sloupec632]]+Y45,(Tabulka3[[#This Row],[Sloupec64]]*Tabulka3[[#This Row],[Sloupec62]]*Tabulka3[[#This Row],[Sloupec24]])+Tabulka3[[#This Row],[Sloupec63]]*Tabulka3[[#This Row],[Sloupec632]]+Y45))","v":0},null,"","","","lesk","ne","",{"$f":"IF(Tabulka3[[#This Row],[Sloupec1]]=1,\"Jednostranne\",IF(Tabulka3[[#This Row],[Sloupec1]]=2,\"Oboustranne\",\"Nezadano\"))","v":"Jednostranne"},{"$f":"IF(Tabulka3[[#This Row],[Sloupec2]]=TRUE,\"Zastrik\",IF(Tabulka3[[#This Row],[Sloupec2]]=FALSE,\" \",\"Chyba\"))","v":" "},{"$f":"IF(Tabulka3[[#This Row],[Sloupec22]]=TRUE,\"Zastrik\",IF(Tabulka3[[#This Row],[Sloupec22]]=FALSE,\" \",\"Chyba\"))","v":" "},{"$f":"IF(Tabulka3[[#This Row],[Sloupec222]]=TRUE,\"Zastrik\",IF(Tabulka3[[#This Row],[Sloupec222]]=FALSE,\" \",\"Chyba\"))","v":" "},{"$f":"IF(Tabulka3[[#This Row],[Sloupec23]]=TRUE,\"Zastrik\",IF(Tabulka3[[#This Row],[Sloupec23]]=FALSE,\" \",\"Chyba\"))","v":" "},null,{"$f":"IF(AO45=\"\",30,AO45)","v":30},{"$f":"IF(Tabulka3[[#This Row],[Sloupec2]],($BB45*C45/1000000)*I45,\"\")","v":""},{"$f":"IF(Tabulka3[[#This Row],[Sloupec22]],($BB45*C45/1000000)*I45,\"\")","v":""},{"$f":"IF(Tabulka3[[#This Row],[Sloupec222]],($BB45*E45/1000000)*I45,\"\")","v":""},{"$f":"IF(Tabulka3[[#This Row],[Sloupec23]],($BB45*E45/1000000)*I45,\"\")","v":""},0,0,0]
["25.",null,null,"",null,"",null,"",null,"",null,null,null,null,null,null,null,null,null,null,{"$f":"IF(I46=\"\",\"\",Tabulka3[[#This Row],[Sloupec64]]+Tabulka3[[#This Row],[Sloupec63]]+BG46)","v":""},"",null,null,{"$f":"IF($I$13=\"ano\",Tabulka3[[#This Row],[Sloupec64]]*100,IF(OR($I$13=\"\",$I$13=\"ne\"),0,\"chyba\"))","v":0},1,false,false,false,false,{"$f":"IF(OR(Tabulka3[[#This Row],[Sloupec2]]=TRUE,Tabulka3[[#This Row],[Sloupec22]]=TRUE,Tabulka3[[#This Row],[Sloupec222]]=TRUE,Tabulka3[[#This Row],[Sloupec23]]=TRUE),1.1,1)","v":1},0,0,0,0,{"$f":"IF(Tabulka3[[#This Row],[Sloupec1]]=1,(C46*E46/1000000)*I46,((C46*E46/1000000)*I46)*2)","v":0},{"$f":"Tabulka3[[#This Row],[Sloupec3]]+Tabulka3[[#This Row],[Sloupec4]]+Tabulka3[[#This Row],[Sloupec5]]+Tabulka3[[#This Row],[Sloupec6]]","v":0},{"$f":"IF($I$12=\"\",0,VLOOKUP($I$12,Pomocné!C:E,2,FALSE))","v":1600},{"$f":"IF(Tabulka3[[#This Row],[Sloupec1]]=1,VLOOKUP($I$12,Tabulka1[],2,FALSE),VLOOKUP($I$12,Tabulka1[],3,FALSE))","v":1600},{"$f":"IF(U46=\"\",0,IF(Tabulka3[[#This Row],[Sloupec24]]=1,Tabulka3[[#This Row],[Sloupec64]]*Tabulka3[[#This Row],[Sloupec62]]+Tabulka3[[#This Row],[Sloupec63]]*Tabulka3[[#This Row],[Sloupec632]]+Y46,(Tabulka3[[#This Row],[Sloupec64]]*Tabulka3[[#This Row],[Sloupec62]]*Tabulka3[[#This Row],[Sloupec24]])+Tabulka3[[#This Row],[Sloupec63]]*Tabulka3[[#This Row],[Sloupec632]]+Y46))","v":0},null,"","","","lesk","ne","",{"$f":"IF(Tabulka3[[#This Row],[Sloupec1]]=1,\"Jednostranne\",IF(Tabulka3[[#This Row],[Sloupec1]]=2,\"Oboustranne\",\"Nezadano\"))","v":"Jednostranne"},{"$f":"IF(Tabulka3[[#This Row],[Sloupec2]]=TRUE,\"Zastrik\",IF(Tabulka3[[#This Row],[Sloupec2]]=FALSE,\" \",\"Chyba\"))","v":" "},{"$f":"IF(Tabulka3[[#This Row],[Sloupec22]]=TRUE,\"Zastrik\",IF(Tabulka3[[#This Row],[Sloupec22]]=FALSE,\" \",\"Chyba\"))","v":" "},{"$f":"IF(Tabulka3[[#This Row],[Sloupec222]]=TRUE,\"Zastrik\",IF(Tabulka3[[#This Row],[Sloupec222]]=FALSE,\" \",\"Chyba\"))","v":" "},{"$f":"IF(Tabulka3[[#This Row],[Sloupec23]]=TRUE,\"Zastrik\",IF(Tabulka3[[#This Row],[Sloupec23]]=FALSE,\" \",\"Chyba\"))","v":" "},null,{"$f":"IF(AO46=\"\",30,AO46)","v":30},{"$f":"IF(Tabulka3[[#This Row],[Sloupec2]],($BB46*C46/1000000)*I46,\"\")","v":""},{"$f":"IF(Tabulka3[[#This Row],[Sloupec22]],($BB46*C46/1000000)*I46,\"\")","v":""},{"$f":"IF(Tabulka3[[#This Row],[Sloupec222]],($BB46*E46/1000000)*I46,\"\")","v":""},{"$f":"IF(Tabulka3[[#This Row],[Sloupec23]],($BB46*E46/1000000)*I46,\"\")","v":""},0,0,0]
["26.",null,null,"",null,"",null,"",null,"",null,null,null,null,null,null,null,null,null,null,{"$f":"IF(I47=\"\",\"\",Tabulka3[[#This Row],[Sloupec64]]+Tabulka3[[#This Row],[Sloupec63]]+BG47)","v":""},"",null,null,{"$f":"IF($I$13=\"ano\",Tabulka3[[#This Row],[Sloupec64]]*100,IF(OR($I$13=\"\",$I$13=\"ne\"),0,\"chyba\"))","v":0},1,false,false,false,false,{"$f":"IF(OR(Tabulka3[[#This Row],[Sloupec2]]=TRUE,Tabulka3[[#This Row],[Sloupec22]]=TRUE,Tabulka3[[#This Row],[Sloupec222]]=TRUE,Tabulka3[[#This Row],[Sloupec23]]=TRUE),1.1,1)","v":1},0,0,0,0,{"$f":"IF(Tabulka3[[#This Row],[Sloupec1]]=1,(C47*E47/1000000)*I47,((C47*E47/1000000)*I47)*2)","v":0},{"$f":"Tabulka3[[#This Row],[Sloupec3]]+Tabulka3[[#This Row],[Sloupec4]]+Tabulka3[[#This Row],[Sloupec5]]+Tabulka3[[#This Row],[Sloupec6]]","v":0},{"$f":"IF($I$12=\"\",0,VLOOKUP($I$12,Pomocné!C:E,2,FALSE))","v":1600},{"$f":"IF(Tabulka3[[#This Row],[Sloupec1]]=1,VLOOKUP($I$12,Tabulka1[],2,FALSE),VLOOKUP($I$12,Tabulka1[],3,FALSE))","v":1600},{"$f":"IF(U47=\"\",0,IF(Tabulka3[[#This Row],[Sloupec24]]=1,Tabulka3[[#This Row],[Sloupec64]]*Tabulka3[[#This Row],[Sloupec62]]+Tabulka3[[#This Row],[Sloupec63]]*Tabulka3[[#This Row],[Sloupec632]]+Y47,(Tabulka3[[#This Row],[Sloupec64]]*Tabulka3[[#This Row],[Sloupec62]]*Tabulka3[[#This Row],[Sloupec24]])+Tabulka3[[#This Row],[Sloupec63]]*Tabulka3[[#This Row],[Sloupec632]]+Y47))","v":0},null,"","","","lesk","ne","",{"$f":"IF(Tabulka3[[#This Row],[Sloupec1]]=1,\"Jednostranne\",IF(Tabulka3[[#This Row],[Sloupec1]]=2,\"Oboustranne\",\"Nezadano\"))","v":"Jednostranne"},{"$f":"IF(Tabulka3[[#This Row],[Sloupec2]]=TRUE,\"Zastrik\",IF(Tabulka3[[#This Row],[Sloupec2]]=FALSE,\" \",\"Chyba\"))","v":" "},{"$f":"IF(Tabulka3[[#This Row],[Sloupec22]]=TRUE,\"Zastrik\",IF(Tabulka3[[#This Row],[Sloupec22]]=FALSE,\" \",\"Chyba\"))","v":" "},{"$f":"IF(Tabulka3[[#This Row],[Sloupec222]]=TRUE,\"Zastrik\",IF(Tabulka3[[#This Row],[Sloupec222]]=FALSE,\" \",\"Chyba\"))","v":" "},{"$f":"IF(Tabulka3[[#This Row],[Sloupec23]]=TRUE,\"Zastrik\",IF(Tabulka3[[#This Row],[Sloupec23]]=FALSE,\" \",\"Chyba\"))","v":" "},null,{"$f":"IF(AO47=\"\",30,AO47)","v":30},{"$f":"IF(Tabulka3[[#This Row],[Sloupec2]],($BB47*C47/1000000)*I47,\"\")","v":""},{"$f":"IF(Tabulka3[[#This Row],[Sloupec22]],($BB47*C47/1000000)*I47,\"\")","v":""},{"$f":"IF(Tabulka3[[#This Row],[Sloupec222]],($BB47*E47/1000000)*I47,\"\")","v":""},{"$f":"IF(Tabulka3[[#This Row],[Sloupec23]],($BB47*E47/1000000)*I47,\"\")","v":""},0,0,0]
["27.",null,null,"",null,"",null,"",null,"",null,null,null,null,null,null,null,null,null,null,{"$f":"IF(I48=\"\",\"\",Tabulka3[[#This Row],[Sloupec64]]+Tabulka3[[#This Row],[Sloupec63]]+BG48)","v":""},"",null,null,{"$f":"IF($I$13=\"ano\",Tabulka3[[#This Row],[Sloupec64]]*100,IF(OR($I$13=\"\",$I$13=\"ne\"),0,\"chyba\"))","v":0},1,false,false,false,false,{"$f":"IF(OR(Tabulka3[[#This Row],[Sloupec2]]=TRUE,Tabulka3[[#This Row],[Sloupec22]]=TRUE,Tabulka3[[#This Row],[Sloupec222]]=TRUE,Tabulka3[[#This Row],[Sloupec23]]=TRUE),1.1,1)","v":1},0,0,0,0,{"$f":"IF(Tabulka3[[#This Row],[Sloupec1]]=1,(C48*E48/1000000)*I48,((C48*E48/1000000)*I48)*2)","v":0},{"$f":"Tabulka3[[#This Row],[Sloupec3]]+Tabulka3[[#This Row],[Sloupec4]]+Tabulka3[[#This Row],[Sloupec5]]+Tabulka3[[#This Row],[Sloupec6]]","v":0},{"$f":"IF($I$12=\"\",0,VLOOKUP($I$12,Pomocné!C:E,2,FALSE))","v":1600},{"$f":"IF(Tabulka3[[#This Row],[Sloupec1]]=1,VLOOKUP($I$12,Tabulka1[],2,FALSE),VLOOKUP($I$12,Tabulka1[],3,FALSE))","v":1600},{"$f":"IF(U48=\"\",0,IF(Tabulka3[[#This Row],[Sloupec24]]=1,Tabulka3[[#This Row],[Sloupec64]]*Tabulka3[[#This Row],[Sloupec62]]+Tabulka3[[#This Row],[Sloupec63]]*Tabulka3[[#This Row],[Sloupec632]]+Y48,(Tabulka3[[#This Row],[Sloupec64]]*Tabulka3[[#This Row],[Sloupec62]]*Tabulka3[[#This Row],[Sloupec24]])+Tabulka3[[#This Row],[Sloupec63]]*Tabulka3[[#This Row],[Sloupec632]]+Y48))","v":0},null,"","","","lesk","ne","",{"$f":"IF(Tabulka3[[#This Row],[Sloupec1]]=1,\"Jednostranne\",IF(Tabulka3[[#This Row],[Sloupec1]]=2,\"Oboustranne\",\"Nezadano\"))","v":"Jednostranne"},{"$f":"IF(Tabulka3[[#This Row],[Sloupec2]]=TRUE,\"Zastrik\",IF(Tabulka3[[#This Row],[Sloupec2]]=FALSE,\" \",\"Chyba\"))","v":" "},{"$f":"IF(Tabulka3[[#This Row],[Sloupec22]]=TRUE,\"Zastrik\",IF(Tabulka3[[#This Row],[Sloupec22]]=FALSE,\" \",\"Chyba\"))","v":" "},{"$f":"IF(Tabulka3[[#This Row],[Sloupec222]]=TRUE,\"Zastrik\",IF(Tabulka3[[#This Row],[Sloupec222]]=FALSE,\" \",\"Chyba\"))","v":" "},{"$f":"IF(Tabulka3[[#This Row],[Sloupec23]]=TRUE,\"Zastrik\",IF(Tabulka3[[#This Row],[Sloupec23]]=FALSE,\" \",\"Chyba\"))","v":" "},null,{"$f":"IF(AO48=\"\",30,AO48)","v":30},{"$f":"IF(Tabulka3[[#This Row],[Sloupec2]],($BB48*C48/1000000)*I48,\"\")","v":""},{"$f":"IF(Tabulka3[[#This Row],[Sloupec22]],($BB48*C48/1000000)*I48,\"\")","v":""},{"$f":"IF(Tabulka3[[#This Row],[Sloupec222]],($BB48*E48/1000000)*I48,\"\")","v":""},{"$f":"IF(Tabulka3[[#This Row],[Sloupec23]],($BB48*E48/1000000)*I48,\"\")","v":""},0,0,0]
["28.",null,null,"",null,"",null,"",null,"",null,null,null,null,null,null,null,null,null,null,{"$f":"IF(I49=\"\",\"\",Tabulka3[[#This Row],[Sloupec64]]+Tabulka3[[#This Row],[Sloupec63]]+BG49)","v":""},"",null,null,{"$f":"IF($I$13=\"ano\",Tabulka3[[#This Row],[Sloupec64]]*100,IF(OR($I$13=\"\",$I$13=\"ne\"),0,\"chyba\"))","v":0},1,false,false,false,false,{"$f":"IF(OR(Tabulka3[[#This Row],[Sloupec2]]=TRUE,Tabulka3[[#This Row],[Sloupec22]]=TRUE,Tabulka3[[#This Row],[Sloupec222]]=TRUE,Tabulka3[[#This Row],[Sloupec23]]=TRUE),1.1,1)","v":1},0,0,0,0,{"$f":"IF(Tabulka3[[#This Row],[Sloupec1]]=1,(C49*E49/1000000)*I49,((C49*E49/1000000)*I49)*2)","v":0},{"$f":"Tabulka3[[#This Row],[Sloupec3]]+Tabulka3[[#This Row],[Sloupec4]]+Tabulka3[[#This Row],[Sloupec5]]+Tabulka3[[#This Row],[Sloupec6]]","v":0},{"$f":"IF($I$12=\"\",0,VLOOKUP($I$12,Pomocné!C:E,2,FALSE))","v":1600},{"$f":"IF(Tabulka3[[#This Row],[Sloupec1]]=1,VLOOKUP($I$12,Tabulka1[],2,FALSE),VLOOKUP($I$12,Tabulka1[],3,FALSE))","v":1600},{"$f":"IF(U49=\"\",0,IF(Tabulka3[[#This Row],[Sloupec24]]=1,Tabulka3[[#This Row],[Sloupec64]]*Tabulka3[[#This Row],[Sloupec62]]+Tabulka3[[#This Row],[Sloupec63]]*Tabulka3[[#This Row],[Sloupec632]]+Y49,(Tabulka3[[#This Row],[Sloupec64]]*Tabulka3[[#This Row],[Sloupec62]]*Tabulka3[[#This Row],[Sloupec24]])+Tabulka3[[#This Row],[Sloupec63]]*Tabulka3[[#This Row],[Sloupec632]]+Y49))","v":0},null,"","","","lesk","ne","",{"$f":"IF(Tabulka3[[#This Row],[Sloupec1]]=1,\"Jednostranne\",IF(Tabulka3[[#This Row],[Sloupec1]]=2,\"Oboustranne\",\"Nezadano\"))","v":"Jednostranne"},{"$f":"IF(Tabulka3[[#This Row],[Sloupec2]]=TRUE,\"Zastrik\",IF(Tabulka3[[#This Row],[Sloupec2]]=FALSE,\" \",\"Chyba\"))","v":" "},{"$f":"IF(Tabulka3[[#This Row],[Sloupec22]]=TRUE,\"Zastrik\",IF(Tabulka3[[#This Row],[Sloupec22]]=FALSE,\" \",\"Chyba\"))","v":" "},{"$f":"IF(Tabulka3[[#This Row],[Sloupec222]]=TRUE,\"Zastrik\",IF(Tabulka3[[#This Row],[Sloupec222]]=FALSE,\" \",\"Chyba\"))","v":" "},{"$f":"IF(Tabulka3[[#This Row],[Sloupec23]]=TRUE,\"Zastrik\",IF(Tabulka3[[#This Row],[Sloupec23]]=FALSE,\" \",\"Chyba\"))","v":" "},null,{"$f":"IF(AO49=\"\",30,AO49)","v":30},{"$f":"IF(Tabulka3[[#This Row],[Sloupec2]],($BB49*C49/1000000)*I49,\"\")","v":""},{"$f":"IF(Tabulka3[[#This Row],[Sloupec22]],($BB49*C49/1000000)*I49,\"\")","v":""},{"$f":"IF(Tabulka3[[#This Row],[Sloupec222]],($BB49*E49/1000000)*I49,\"\")","v":""},{"$f":"IF(Tabulka3[[#This Row],[Sloupec23]],($BB49*E49/1000000)*I49,\"\")","v":""},0,0,0]
["29.",null,null,"",null,"",null,"",null,"",null,null,null,null,null,null,null,null,null,null,{"$f":"IF(I50=\"\",\"\",Tabulka3[[#This Row],[Sloupec64]]+Tabulka3[[#This Row],[Sloupec63]]+BG50)","v":""},"",null,null,{"$f":"IF($I$13=\"ano\",Tabulka3[[#This Row],[Sloupec64]]*100,IF(OR($I$13=\"\",$I$13=\"ne\"),0,\"chyba\"))","v":0},1,false,false,false,false,{"$f":"IF(OR(Tabulka3[[#This Row],[Sloupec2]]=TRUE,Tabulka3[[#This Row],[Sloupec22]]=TRUE,Tabulka3[[#This Row],[Sloupec222]]=TRUE,Tabulka3[[#This Row],[Sloupec23]]=TRUE),1.1,1)","v":1},0,0,0,0,{"$f":"IF(Tabulka3[[#This Row],[Sloupec1]]=1,(C50*E50/1000000)*I50,((C50*E50/1000000)*I50)*2)","v":0},{"$f":"Tabulka3[[#This Row],[Sloupec3]]+Tabulka3[[#This Row],[Sloupec4]]+Tabulka3[[#This Row],[Sloupec5]]+Tabulka3[[#This Row],[Sloupec6]]","v":0},{"$f":"IF($I$12=\"\",0,VLOOKUP($I$12,Pomocné!C:E,2,FALSE))","v":1600},{"$f":"IF(Tabulka3[[#This Row],[Sloupec1]]=1,VLOOKUP($I$12,Tabulka1[],2,FALSE),VLOOKUP($I$12,Tabulka1[],3,FALSE))","v":1600},{"$f":"IF(U50=\"\",0,IF(Tabulka3[[#This Row],[Sloupec24]]=1,Tabulka3[[#This Row],[Sloupec64]]*Tabulka3[[#This Row],[Sloupec62]]+Tabulka3[[#This Row],[Sloupec63]]*Tabulka3[[#This Row],[Sloupec632]]+Y50,(Tabulka3[[#This Row],[Sloupec64]]*Tabulka3[[#This Row],[Sloupec62]]*Tabulka3[[#This Row],[Sloupec24]])+Tabulka3[[#This Row],[Sloupec63]]*Tabulka3[[#This Row],[Sloupec632]]+Y50))","v":0},null,"","","","lesk","ne","",{"$f":"IF(Tabulka3[[#This Row],[Sloupec1]]=1,\"Jednostranne\",IF(Tabulka3[[#This Row],[Sloupec1]]=2,\"Oboustranne\",\"Nezadano\"))","v":"Jednostranne"},{"$f":"IF(Tabulka3[[#This Row],[Sloupec2]]=TRUE,\"Zastrik\",IF(Tabulka3[[#This Row],[Sloupec2]]=FALSE,\" \",\"Chyba\"))","v":" "},{"$f":"IF(Tabulka3[[#This Row],[Sloupec22]]=TRUE,\"Zastrik\",IF(Tabulka3[[#This Row],[Sloupec22]]=FALSE,\" \",\"Chyba\"))","v":" "},{"$f":"IF(Tabulka3[[#This Row],[Sloupec222]]=TRUE,\"Zastrik\",IF(Tabulka3[[#This Row],[Sloupec222]]=FALSE,\" \",\"Chyba\"))","v":" "},{"$f":"IF(Tabulka3[[#This Row],[Sloupec23]]=TRUE,\"Zastrik\",IF(Tabulka3[[#This Row],[Sloupec23]]=FALSE,\" \",\"Chyba\"))","v":" "},null,{"$f":"IF(AO50=\"\",30,AO50)","v":30},{"$f":"IF(Tabulka3[[#This Row],[Sloupec2]],($BB50*C50/1000000)*I50,\"\")","v":""},{"$f":"IF(Tabulka3[[#This Row],[Sloupec22]],($BB50*C50/1000000)*I50,\"\")","v":""},{"$f":"IF(Tabulka3[[#This Row],[Sloupec222]],($BB50*E50/1000000)*I50,\"\")","v":""},{"$f":"IF(Tabulka3[[#This Row],[Sloupec23]],($BB50*E50/1000000)*I50,\"\")","v":""},0,0,0]
["30.",null,null,"",null,"",null,"",null,"",null,null,null,null,null,null,null,null,null,null,{"$f":"IF(I51=\"\",\"\",Tabulka3[[#This Row],[Sloupec64]]+Tabulka3[[#This Row],[Sloupec63]]+BG51)","v":""},"",null,null,{"$f":"IF($I$13=\"ano\",Tabulka3[[#This Row],[Sloupec64]]*100,IF(OR($I$13=\"\",$I$13=\"ne\"),0,\"chyba\"))","v":0},1,false,false,false,false,{"$f":"IF(OR(Tabulka3[[#This Row],[Sloupec2]]=TRUE,Tabulka3[[#This Row],[Sloupec22]]=TRUE,Tabulka3[[#This Row],[Sloupec222]]=TRUE,Tabulka3[[#This Row],[Sloupec23]]=TRUE),1.1,1)","v":1},0,0,0,0,{"$f":"IF(Tabulka3[[#This Row],[Sloupec1]]=1,(C51*E51/1000000)*I51,((C51*E51/1000000)*I51)*2)","v":0},{"$f":"Tabulka3[[#This Row],[Sloupec3]]+Tabulka3[[#This Row],[Sloupec4]]+Tabulka3[[#This Row],[Sloupec5]]+Tabulka3[[#This Row],[Sloupec6]]","v":0},{"$f":"IF($I$12=\"\",0,VLOOKUP($I$12,Pomocné!C:E,2,FALSE))","v":1600},{"$f":"IF(Tabulka3[[#This Row],[Sloupec1]]=1,VLOOKUP($I$12,Tabulka1[],2,FALSE),VLOOKUP($I$12,Tabulka1[],3,FALSE))","v":1600},{"$f":"IF(U51=\"\",0,IF(Tabulka3[[#This Row],[Sloupec24]]=1,Tabulka3[[#This Row],[Sloupec64]]*Tabulka3[[#This Row],[Sloupec62]]+Tabulka3[[#This Row],[Sloupec63]]*Tabulka3[[#This Row],[Sloupec632]]+Y51,(Tabulka3[[#This Row],[Sloupec64]]*Tabulka3[[#This Row],[Sloupec62]]*Tabulka3[[#This Row],[Sloupec24]])+Tabulka3[[#This Row],[Sloupec63]]*Tabulka3[[#This Row],[Sloupec632]]+Y51))","v":0},null,"","","","lesk","ne","",{"$f":"IF(Tabulka3[[#This Row],[Sloupec1]]=1,\"Jednostranne\",IF(Tabulka3[[#This Row],[Sloupec1]]=2,\"Oboustranne\",\"Nezadano\"))","v":"Jednostranne"},{"$f":"IF(Tabulka3[[#This Row],[Sloupec2]]=TRUE,\"Zastrik\",IF(Tabulka3[[#This Row],[Sloupec2]]=FALSE,\" \",\"Chyba\"))","v":" "},{"$f":"IF(Tabulka3[[#This Row],[Sloupec22]]=TRUE,\"Zastrik\",IF(Tabulka3[[#This Row],[Sloupec22]]=FALSE,\" \",\"Chyba\"))","v":" "},{"$f":"IF(Tabulka3[[#This Row],[Sloupec222]]=TRUE,\"Zastrik\",IF(Tabulka3[[#This Row],[Sloupec222]]=FALSE,\" \",\"Chyba\"))","v":" "},{"$f":"IF(Tabulka3[[#This Row],[Sloupec23]]=TRUE,\"Zastrik\",IF(Tabulka3[[#This Row],[Sloupec23]]=FALSE,\" \",\"Chyba\"))","v":" "},null,{"$f":"IF(AO51=\"\",30,AO51)","v":30},{"$f":"IF(Tabulka3[[#This Row],[Sloupec2]],($BB51*C51/1000000)*I51,\"\")","v":""},{"$f":"IF(Tabulka3[[#This Row],[Sloupec22]],($BB51*C51/1000000)*I51,\"\")","v":""},{"$f":"IF(Tabulka3[[#This Row],[Sloupec222]],($BB51*E51/1000000)*I51,\"\")","v":""},{"$f":"IF(Tabulka3[[#This Row],[Sloupec23]],($BB51*E51/1000000)*I51,\"\")","v":""},0,0,0]
["31.",null,null,"",null,"",null,"",null,"",null,null,null,null,null,null,null,null,null,null,{"$f":"IF(I52=\"\",\"\",Tabulka3[[#This Row],[Sloupec64]]+Tabulka3[[#This Row],[Sloupec63]]+BG52)","v":""},"",null,null,{"$f":"IF($I$13=\"ano\",Tabulka3[[#This Row],[Sloupec64]]*100,IF(OR($I$13=\"\",$I$13=\"ne\"),0,\"chyba\"))","v":0},1,false,false,false,false,{"$f":"IF(OR(Tabulka3[[#This Row],[Sloupec2]]=TRUE,Tabulka3[[#This Row],[Sloupec22]]=TRUE,Tabulka3[[#This Row],[Sloupec222]]=TRUE,Tabulka3[[#This Row],[Sloupec23]]=TRUE),1.1,1)","v":1},0,0,0,0,{"$f":"IF(Tabulka3[[#This Row],[Sloupec1]]=1,(C52*E52/1000000)*I52,((C52*E52/1000000)*I52)*2)","v":0},{"$f":"Tabulka3[[#This Row],[Sloupec3]]+Tabulka3[[#This Row],[Sloupec4]]+Tabulka3[[#This Row],[Sloupec5]]+Tabulka3[[#This Row],[Sloupec6]]","v":0},{"$f":"IF($I$12=\"\",0,VLOOKUP($I$12,Pomocné!C:E,2,FALSE))","v":1600},{"$f":"IF(Tabulka3[[#This Row],[Sloupec1]]=1,VLOOKUP($I$12,Tabulka1[],2,FALSE),VLOOKUP($I$12,Tabulka1[],3,FALSE))","v":1600},{"$f":"IF(U52=\"\",0,IF(Tabulka3[[#This Row],[Sloupec24]]=1,Tabulka3[[#This Row],[Sloupec64]]*Tabulka3[[#This Row],[Sloupec62]]+Tabulka3[[#This Row],[Sloupec63]]*Tabulka3[[#This Row],[Sloupec632]]+Y52,(Tabulka3[[#This Row],[Sloupec64]]*Tabulka3[[#This Row],[Sloupec62]]*Tabulka3[[#This Row],[Sloupec24]])+Tabulka3[[#This Row],[Sloupec63]]*Tabulka3[[#This Row],[Sloupec632]]+Y52))","v":0},null,"","","","lesk","ne","",{"$f":"IF(Tabulka3[[#This Row],[Sloupec1]]=1,\"Jednostranne\",IF(Tabulka3[[#This Row],[Sloupec1]]=2,\"Oboustranne\",\"Nezadano\"))","v":"Jednostranne"},{"$f":"IF(Tabulka3[[#This Row],[Sloupec2]]=TRUE,\"Zastrik\",IF(Tabulka3[[#This Row],[Sloupec2]]=FALSE,\" \",\"Chyba\"))","v":" "},{"$f":"IF(Tabulka3[[#This Row],[Sloupec22]]=TRUE,\"Zastrik\",IF(Tabulka3[[#This Row],[Sloupec22]]=FALSE,\" \",\"Chyba\"))","v":" "},{"$f":"IF(Tabulka3[[#This Row],[Sloupec222]]=TRUE,\"Zastrik\",IF(Tabulka3[[#This Row],[Sloupec222]]=FALSE,\" \",\"Chyba\"))","v":" "},{"$f":"IF(Tabulka3[[#This Row],[Sloupec23]]=TRUE,\"Zastrik\",IF(Tabulka3[[#This Row],[Sloupec23]]=FALSE,\" \",\"Chyba\"))","v":" "},null,{"$f":"IF(AO52=\"\",30,AO52)","v":30},{"$f":"IF(Tabulka3[[#This Row],[Sloupec2]],($BB52*C52/1000000)*I52,\"\")","v":""},{"$f":"IF(Tabulka3[[#This Row],[Sloupec22]],($BB52*C52/1000000)*I52,\"\")","v":""},{"$f":"IF(Tabulka3[[#This Row],[Sloupec222]],($BB52*E52/1000000)*I52,\"\")","v":""},{"$f":"IF(Tabulka3[[#This Row],[Sloupec23]],($BB52*E52/1000000)*I52,\"\")","v":""},0,0,0]
["33.",null,null,"",null,"",null,"",null,"",null,null,null,null,null,null,null,null,null,null,{"$f":"IF(I53=\"\",\"\",Tabulka3[[#This Row],[Sloupec64]]+Tabulka3[[#This Row],[Sloupec63]]+BG53)","v":""},"",null,null,{"$f":"IF($I$13=\"ano\",Tabulka3[[#This Row],[Sloupec64]]*100,IF(OR($I$13=\"\",$I$13=\"ne\"),0,\"chyba\"))","v":0},1,false,false,false,false,{"$f":"IF(OR(Tabulka3[[#This Row],[Sloupec2]]=TRUE,Tabulka3[[#This Row],[Sloupec22]]=TRUE,Tabulka3[[#This Row],[Sloupec222]]=TRUE,Tabulka3[[#This Row],[Sloupec23]]=TRUE),1.1,1)","v":1},0,0,0,0,{"$f":"IF(Tabulka3[[#This Row],[Sloupec1]]=1,(C53*E53/1000000)*I53,((C53*E53/1000000)*I53)*2)","v":0},{"$f":"Tabulka3[[#This Row],[Sloupec3]]+Tabulka3[[#This Row],[Sloupec4]]+Tabulka3[[#This Row],[Sloupec5]]+Tabulka3[[#This Row],[Sloupec6]]","v":0},{"$f":"IF($I$12=\"\",0,VLOOKUP($I$12,Pomocné!C:E,2,FALSE))","v":1600},{"$f":"IF(Tabulka3[[#This Row],[Sloupec1]]=1,VLOOKUP($I$12,Tabulka1[],2,FALSE),VLOOKUP($I$12,Tabulka1[],3,FALSE))","v":1600},{"$f":"IF(U53=\"\",0,IF(Tabulka3[[#This Row],[Sloupec24]]=1,Tabulka3[[#This Row],[Sloupec64]]*Tabulka3[[#This Row],[Sloupec62]]+Tabulka3[[#This Row],[Sloupec63]]*Tabulka3[[#This Row],[Sloupec632]]+Y53,(Tabulka3[[#This Row],[Sloupec64]]*Tabulka3[[#This Row],[Sloupec62]]*Tabulka3[[#This Row],[Sloupec24]])+Tabulka3[[#This Row],[Sloupec63]]*Tabulka3[[#This Row],[Sloupec632]]+Y53))","v":0},null,"","","","lesk","ne","",{"$f":"IF(Tabulka3[[#This Row],[Sloupec1]]=1,\"Jednostranne\",IF(Tabulka3[[#This Row],[Sloupec1]]=2,\"Oboustranne\",\"Nezadano\"))","v":"Jednostranne"},{"$f":"IF(Tabulka3[[#This Row],[Sloupec2]]=TRUE,\"Zastrik\",IF(Tabulka3[[#This Row],[Sloupec2]]=FALSE,\" \",\"Chyba\"))","v":" "},{"$f":"IF(Tabulka3[[#This Row],[Sloupec22]]=TRUE,\"Zastrik\",IF(Tabulka3[[#This Row],[Sloupec22]]=FALSE,\" \",\"Chyba\"))","v":" "},{"$f":"IF(Tabulka3[[#This Row],[Sloupec222]]=TRUE,\"Zastrik\",IF(Tabulka3[[#This Row],[Sloupec222]]=FALSE,\" \",\"Chyba\"))","v":" "},{"$f":"IF(Tabulka3[[#This Row],[Sloupec23]]=TRUE,\"Zastrik\",IF(Tabulka3[[#This Row],[Sloupec23]]=FALSE,\" \",\"Chyba\"))","v":" "},null,{"$f":"IF(AO53=\"\",30,AO53)","v":30},{"$f":"IF(Tabulka3[[#This Row],[Sloupec2]],($BB53*C53/1000000)*I53,\"\")","v":""},{"$f":"IF(Tabulka3[[#This Row],[Sloupec22]],($BB53*C53/1000000)*I53,\"\")","v":""},{"$f":"IF(Tabulka3[[#This Row],[Sloupec222]],($BB53*E53/1000000)*I53,\"\")","v":""},{"$f":"IF(Tabulka3[[#This Row],[Sloupec23]],($BB53*E53/1000000)*I53,\"\")","v":""},0,0,0]
["34.",null,null,"",null,"",null,"",null,"",null,null,null,null,null,null,null,null,null,null,{"$f":"IF(I54=\"\",\"\",Tabulka3[[#This Row],[Sloupec64]]+Tabulka3[[#This Row],[Sloupec63]]+BG54)","v":""},"",null,null,{"$f":"IF($I$13=\"ano\",Tabulka3[[#This Row],[Sloupec64]]*100,IF(OR($I$13=\"\",$I$13=\"ne\"),0,\"chyba\"))","v":0},1,false,false,false,false,{"$f":"IF(OR(Tabulka3[[#This Row],[Sloupec2]]=TRUE,Tabulka3[[#This Row],[Sloupec22]]=TRUE,Tabulka3[[#This Row],[Sloupec222]]=TRUE,Tabulka3[[#This Row],[Sloupec23]]=TRUE),1.1,1)","v":1},{"$f":"IF(OR(M54=\"N\",M54=\"\"),0,($C54*$G54/1000000)*I54)","v":0},{"$f":"IF(OR(O54=\"N\",O54=\"\"),0,($C54*$G54/1000000)*I54)","v":0},{"$f":"IF(OR(Q54=\"N\",Q54=\"\"),0,($E54*$G54/1000000)*I54)","v":0},{"$f":"IF(OR(S54=\"N\",S54=\"\"),0,($E54*$G54/1000000)*I54)","v":0},{"$f":"IF(Tabulka3[[#This Row],[Sloupec1]]=1,(C54*E54/1000000)*I54,((C54*E54/1000000)*I54)*2)","v":0},{"$f":"Tabulka3[[#This Row],[Sloupec3]]+Tabulka3[[#This Row],[Sloupec4]]+Tabulka3[[#This Row],[Sloupec5]]+Tabulka3[[#This Row],[Sloupec6]]","v":0},{"$f":"IF($I$12=\"\",0,VLOOKUP($I$12,Pomocné!C:E,2,FALSE))","v":1600},{"$f":"IF(Tabulka3[[#This Row],[Sloupec1]]=1,VLOOKUP($I$12,Tabulka1[],2,FALSE),VLOOKUP($I$12,Tabulka1[],3,FALSE))","v":1600},{"$f":"IF(U54=\"\",0,IF(Tabulka3[[#This Row],[Sloupec24]]=1,Tabulka3[[#This Row],[Sloupec64]]*Tabulka3[[#This Row],[Sloupec62]]+Tabulka3[[#This Row],[Sloupec63]]*Tabulka3[[#This Row],[Sloupec632]]+Y54,(Tabulka3[[#This Row],[Sloupec64]]*Tabulka3[[#This Row],[Sloupec62]]*Tabulka3[[#This Row],[Sloupec24]])+Tabulka3[[#This Row],[Sloupec63]]*Tabulka3[[#This Row],[Sloupec632]]+Y54))","v":0},null,"","","","lesk","ne","",{"$f":"IF(Tabulka3[[#This Row],[Sloupec1]]=1,\"Jednostranne\",IF(Tabulka3[[#This Row],[Sloupec1]]=2,\"Oboustranne\",\"Nezadano\"))","v":"Jednostranne"},{"$f":"IF(Tabulka3[[#This Row],[Sloupec2]]=TRUE,\"Zastrik\",IF(Tabulka3[[#This Row],[Sloupec2]]=FALSE,\" \",\"Chyba\"))","v":" "},{"$f":"IF(Tabulka3[[#This Row],[Sloupec22]]=TRUE,\"Zastrik\",IF(Tabulka3[[#This Row],[Sloupec22]]=FALSE,\" \",\"Chyba\"))","v":" "},{"$f":"IF(Tabulka3[[#This Row],[Sloupec222]]=TRUE,\"Zastrik\",IF(Tabulka3[[#This Row],[Sloupec222]]=FALSE,\" \",\"Chyba\"))","v":" "},{"$f":"IF(Tabulka3[[#This Row],[Sloupec23]]=TRUE,\"Zastrik\",IF(Tabulka3[[#This Row],[Sloupec23]]=FALSE,\" \",\"Chyba\"))","v":" "},null,{"$f":"IF(AO54=\"\",30,AO54)","v":30},{"$f":"IF(Tabulka3[[#This Row],[Sloupec2]],($BB54*C54/1000000)*I54,\"\")","v":""},{"$f":"IF(Tabulka3[[#This Row],[Sloupec22]],($BB54*C54/1000000)*I54,\"\")","v":""},{"$f":"IF(Tabulka3[[#This Row],[Sloupec222]],($BB54*E54/1000000)*I54,\"\")","v":""},{"$f":"IF(Tabulka3[[#This Row],[Sloupec23]],($BB54*E54/1000000)*I54,\"\")","v":""},0,0,0]
["35.",null,null,"",null,"",null,"",null,"",null,null,null,null,null,null,null,null,null,null,{"$f":"IF(I55=\"\",\"\",Tabulka3[[#This Row],[Sloupec64]]+Tabulka3[[#This Row],[Sloupec63]]+BG55)","v":""},"",null,null,{"$f":"IF($I$13=\"ano\",Tabulka3[[#This Row],[Sloupec64]]*100,IF(OR($I$13=\"\",$I$13=\"ne\"),0,\"chyba\"))","v":0},1,false,false,false,false,{"$f":"IF(OR(Tabulka3[[#This Row],[Sloupec2]]=TRUE,Tabulka3[[#This Row],[Sloupec22]]=TRUE,Tabulka3[[#This Row],[Sloupec222]]=TRUE,Tabulka3[[#This Row],[Sloupec23]]=TRUE),1.1,1)","v":1},0,0,0,0,{"$f":"IF(Tabulka3[[#This Row],[Sloupec1]]=1,(C55*E55/1000000)*I55,((C55*E55/1000000)*I55)*2)","v":0},{"$f":"Tabulka3[[#This Row],[Sloupec3]]+Tabulka3[[#This Row],[Sloupec4]]+Tabulka3[[#This Row],[Sloupec5]]+Tabulka3[[#This Row],[Sloupec6]]","v":0},{"$f":"IF($I$12=\"\",0,VLOOKUP($I$12,Pomocné!C:E,2,FALSE))","v":1600},{"$f":"IF(Tabulka3[[#This Row],[Sloupec1]]=1,VLOOKUP($I$12,Tabulka1[],2,FALSE),VLOOKUP($I$12,Tabulka1[],3,FALSE))","v":1600},{"$f":"IF(U55=\"\",0,IF(Tabulka3[[#This Row],[Sloupec24]]=1,Tabulka3[[#This Row],[Sloupec64]]*Tabulka3[[#This Row],[Sloupec62]]+Tabulka3[[#This Row],[Sloupec63]]*Tabulka3[[#This Row],[Sloupec632]]+Y55,(Tabulka3[[#This Row],[Sloupec64]]*Tabulka3[[#This Row],[Sloupec62]]*Tabulka3[[#This Row],[Sloupec24]])+Tabulka3[[#This Row],[Sloupec63]]*Tabulka3[[#This Row],[Sloupec632]]+Y55))","v":0},null,"","","","lesk","ne","",{"$f":"IF(Tabulka3[[#This Row],[Sloupec1]]=1,\"Jednostranne\",IF(Tabulka3[[#This Row],[Sloupec1]]=2,\"Oboustranne\",\"Nezadano\"))","v":"Jednostranne"},{"$f":"IF(Tabulka3[[#This Row],[Sloupec2]]=TRUE,\"Zastrik\",IF(Tabulka3[[#This Row],[Sloupec2]]=FALSE,\" \",\"Chyba\"))","v":" "},{"$f":"IF(Tabulka3[[#This Row],[Sloupec22]]=TRUE,\"Zastrik\",IF(Tabulka3[[#This Row],[Sloupec22]]=FALSE,\" \",\"Chyba\"))","v":" "},{"$f":"IF(Tabulka3[[#This Row],[Sloupec222]]=TRUE,\"Zastrik\",IF(Tabulka3[[#This Row],[Sloupec222]]=FALSE,\" \",\"Chyba\"))","v":" "},{"$f":"IF(Tabulka3[[#This Row],[Sloupec23]]=TRUE,\"Zastrik\",IF(Tabulka3[[#This Row],[Sloupec23]]=FALSE,\" \",\"Chyba\"))","v":" "},null,{"$f":"IF(AO55=\"\",30,AO55)","v":30},{"$f":"IF(Tabulka3[[#This Row],[Sloupec2]],($BB55*C55/1000000)*I55,\"\")","v":""},{"$f":"IF(Tabulka3[[#This Row],[Sloupec22]],($BB55*C55/1000000)*I55,\"\")","v":""},{"$f":"IF(Tabulka3[[#This Row],[Sloupec222]],($BB55*E55/1000000)*I55,\"\")","v":""},{"$f":"IF(Tabulka3[[#This Row],[Sloupec23]],($BB55*E55/1000000)*I55,\"\")","v":""},0,0,0]
["36.",null,null,"",null,"",null,"",null,"",null,null,null,null,null,null,null,null,null,null,{"$f":"IF(I56=\"\",\"\",Tabulka3[[#This Row],[Sloupec64]]+Tabulka3[[#This Row],[Sloupec63]]+BG56)","v":""},"",null,null,{"$f":"IF($I$13=\"ano\",Tabulka3[[#This Row],[Sloupec64]]*100,IF(OR($I$13=\"\",$I$13=\"ne\"),0,\"chyba\"))","v":0},1,false,false,false,false,{"$f":"IF(OR(Tabulka3[[#This Row],[Sloupec2]]=TRUE,Tabulka3[[#This Row],[Sloupec22]]=TRUE,Tabulka3[[#This Row],[Sloupec222]]=TRUE,Tabulka3[[#This Row],[Sloupec23]]=TRUE),1.1,1)","v":1},0,0,0,0,{"$f":"IF(Tabulka3[[#This Row],[Sloupec1]]=1,(C56*E56/1000000)*I56,((C56*E56/1000000)*I56)*2)","v":0},{"$f":"Tabulka3[[#This Row],[Sloupec3]]+Tabulka3[[#This Row],[Sloupec4]]+Tabulka3[[#This Row],[Sloupec5]]+Tabulka3[[#This Row],[Sloupec6]]","v":0},{"$f":"IF($I$12=\"\",0,VLOOKUP($I$12,Pomocné!C:E,2,FALSE))","v":1600},{"$f":"IF(Tabulka3[[#This Row],[Sloupec1]]=1,VLOOKUP($I$12,Tabulka1[],2,FALSE),VLOOKUP($I$12,Tabulka1[],3,FALSE))","v":1600},{"$f":"IF(U56=\"\",0,IF(Tabulka3[[#This Row],[Sloupec24]]=1,Tabulka3[[#This Row],[Sloupec64]]*Tabulka3[[#This Row],[Sloupec62]]+Tabulka3[[#This Row],[Sloupec63]]*Tabulka3[[#This Row],[Sloupec632]]+Y56,(Tabulka3[[#This Row],[Sloupec64]]*Tabulka3[[#This Row],[Sloupec62]]*Tabulka3[[#This Row],[Sloupec24]])+Tabulka3[[#This Row],[Sloupec63]]*Tabulka3[[#This Row],[Sloupec632]]+Y56))","v":0},null,"","","","lesk","ne","",{"$f":"IF(Tabulka3[[#This Row],[Sloupec1]]=1,\"Jednostranne\",IF(Tabulka3[[#This Row],[Sloupec1]]=2,\"Oboustranne\",\"Nezadano\"))","v":"Jednostranne"},{"$f":"IF(Tabulka3[[#This Row],[Sloupec2]]=TRUE,\"Zastrik\",IF(Tabulka3[[#This Row],[Sloupec2]]=FALSE,\" \",\"Chyba\"))","v":" "},{"$f":"IF(Tabulka3[[#This Row],[Sloupec22]]=TRUE,\"Zastrik\",IF(Tabulka3[[#This Row],[Sloupec22]]=FALSE,\" \",\"Chyba\"))","v":" "},{"$f":"IF(Tabulka3[[#This Row],[Sloupec222]]=TRUE,\"Zastrik\",IF(Tabulka3[[#This Row],[Sloupec222]]=FALSE,\" \",\"Chyba\"))","v":" "},{"$f":"IF(Tabulka3[[#This Row],[Sloupec23]]=TRUE,\"Zastrik\",IF(Tabulka3[[#This Row],[Sloupec23]]=FALSE,\" \",\"Chyba\"))","v":" "},null,{"$f":"IF(AO56=\"\",30,AO56)","v":30},{"$f":"IF(Tabulka3[[#This Row],[Sloupec2]],($BB56*C56/1000000)*I56,\"\")","v":""},{"$f":"IF(Tabulka3[[#This Row],[Sloupec22]],($BB56*C56/1000000)*I56,\"\")","v":""},{"$f":"IF(Tabulka3[[#This Row],[Sloupec222]],($BB56*E56/1000000)*I56,\"\")","v":""},{"$f":"IF(Tabulka3[[#This Row],[Sloupec23]],($BB56*E56/1000000)*I56,\"\")","v":""},0,0,0]
["37.",null,null,"",null,"",null,"",null,"",null,null,null,null,null,null,null,null,null,null,{"$f":"IF(I57=\"\",\"\",Tabulka3[[#This Row],[Sloupec64]]+Tabulka3[[#This Row],[Sloupec63]]+BG57)","v":""},"",null,null,{"$f":"IF($I$13=\"ano\",Tabulka3[[#This Row],[Sloupec64]]*100,IF(OR($I$13=\"\",$I$13=\"ne\"),0,\"chyba\"))","v":0},1,false,false,false,false,{"$f":"IF(OR(Tabulka3[[#This Row],[Sloupec2]]=TRUE,Tabulka3[[#This Row],[Sloupec22]]=TRUE,Tabulka3[[#This Row],[Sloupec222]]=TRUE,Tabulka3[[#This Row],[Sloupec23]]=TRUE),1.1,1)","v":1},0,0,0,0,{"$f":"IF(Tabulka3[[#This Row],[Sloupec1]]=1,(C57*E57/1000000)*I57,((C57*E57/1000000)*I57)*2)","v":0},{"$f":"Tabulka3[[#This Row],[Sloupec3]]+Tabulka3[[#This Row],[Sloupec4]]+Tabulka3[[#This Row],[Sloupec5]]+Tabulka3[[#This Row],[Sloupec6]]","v":0},{"$f":"IF($I$12=\"\",0,VLOOKUP($I$12,Pomocné!C:E,2,FALSE))","v":1600},{"$f":"IF(Tabulka3[[#This Row],[Sloupec1]]=1,VLOOKUP($I$12,Tabulka1[],2,FALSE),VLOOKUP($I$12,Tabulka1[],3,FALSE))","v":1600},{"$f":"IF(U57=\"\",0,IF(Tabulka3[[#This Row],[Sloupec24]]=1,Tabulka3[[#This Row],[Sloupec64]]*Tabulka3[[#This Row],[Sloupec62]]+Tabulka3[[#This Row],[Sloupec63]]*Tabulka3[[#This Row],[Sloupec632]]+Y57,(Tabulka3[[#This Row],[Sloupec64]]*Tabulka3[[#This Row],[Sloupec62]]*Tabulka3[[#This Row],[Sloupec24]])+Tabulka3[[#This Row],[Sloupec63]]*Tabulka3[[#This Row],[Sloupec632]]+Y57))","v":0},null,"","","","lesk","ne","",{"$f":"IF(Tabulka3[[#This Row],[Sloupec1]]=1,\"Jednostranne\",IF(Tabulka3[[#This Row],[Sloupec1]]=2,\"Oboustranne\",\"Nezadano\"))","v":"Jednostranne"},{"$f":"IF(Tabulka3[[#This Row],[Sloupec2]]=TRUE,\"Zastrik\",IF(Tabulka3[[#This Row],[Sloupec2]]=FALSE,\" \",\"Chyba\"))","v":" "},{"$f":"IF(Tabulka3[[#This Row],[Sloupec22]]=TRUE,\"Zastrik\",IF(Tabulka3[[#This Row],[Sloupec22]]=FALSE,\" \",\"Chyba\"))","v":" "},{"$f":"IF(Tabulka3[[#This Row],[Sloupec222]]=TRUE,\"Zastrik\",IF(Tabulka3[[#This Row],[Sloupec222]]=FALSE,\" \",\"Chyba\"))","v":" "},{"$f":"IF(Tabulka3[[#This Row],[Sloupec23]]=TRUE,\"Zastrik\",IF(Tabulka3[[#This Row],[Sloupec23]]=FALSE,\" \",\"Chyba\"))","v":" "},null,{"$f":"IF(AO57=\"\",30,AO57)","v":30},{"$f":"IF(Tabulka3[[#This Row],[Sloupec2]],($BB57*C57/1000000)*I57,\"\")","v":""},{"$f":"IF(Tabulka3[[#This Row],[Sloupec22]],($BB57*C57/1000000)*I57,\"\")","v":""},{"$f":"IF(Tabulka3[[#This Row],[Sloupec222]],($BB57*E57/1000000)*I57,\"\")","v":""},{"$f":"IF(Tabulka3[[#This Row],[Sloupec23]],($BB57*E57/1000000)*I57,\"\")","v":""},0,0,0]
["38.",null,null,"",null,"",null,"",null,"",null,null,null,null,null,null,null,null,null,null,{"$f":"IF(I58=\"\",\"\",Tabulka3[[#This Row],[Sloupec64]]+Tabulka3[[#This Row],[Sloupec63]]+BG58)","v":""},"",null,null,{"$f":"IF($I$13=\"ano\",Tabulka3[[#This Row],[Sloupec64]]*100,IF(OR($I$13=\"\",$I$13=\"ne\"),0,\"chyba\"))","v":0},1,false,false,false,false,{"$f":"IF(OR(Tabulka3[[#This Row],[Sloupec2]]=TRUE,Tabulka3[[#This Row],[Sloupec22]]=TRUE,Tabulka3[[#This Row],[Sloupec222]]=TRUE,Tabulka3[[#This Row],[Sloupec23]]=TRUE),1.1,1)","v":1},0,0,0,0,{"$f":"IF(Tabulka3[[#This Row],[Sloupec1]]=1,(C58*E58/1000000)*I58,((C58*E58/1000000)*I58)*2)","v":0},{"$f":"Tabulka3[[#This Row],[Sloupec3]]+Tabulka3[[#This Row],[Sloupec4]]+Tabulka3[[#This Row],[Sloupec5]]+Tabulka3[[#This Row],[Sloupec6]]","v":0},{"$f":"IF($I$12=\"\",0,VLOOKUP($I$12,Pomocné!C:E,2,FALSE))","v":1600},{"$f":"IF(Tabulka3[[#This Row],[Sloupec1]]=1,VLOOKUP($I$12,Tabulka1[],2,FALSE),VLOOKUP($I$12,Tabulka1[],3,FALSE))","v":1600},{"$f":"IF(U58=\"\",0,IF(Tabulka3[[#This Row],[Sloupec24]]=1,Tabulka3[[#This Row],[Sloupec64]]*Tabulka3[[#This Row],[Sloupec62]]+Tabulka3[[#This Row],[Sloupec63]]*Tabulka3[[#This Row],[Sloupec632]]+Y58,(Tabulka3[[#This Row],[Sloupec64]]*Tabulka3[[#This Row],[Sloupec62]]*Tabulka3[[#This Row],[Sloupec24]])+Tabulka3[[#This Row],[Sloupec63]]*Tabulka3[[#This Row],[Sloupec632]]+Y58))","v":0},null,"","","","lesk","ne","",{"$f":"IF(Tabulka3[[#This Row],[Sloupec1]]=1,\"Jednostranne\",IF(Tabulka3[[#This Row],[Sloupec1]]=2,\"Oboustranne\",\"Nezadano\"))","v":"Jednostranne"},{"$f":"IF(Tabulka3[[#This Row],[Sloupec2]]=TRUE,\"Zastrik\",IF(Tabulka3[[#This Row],[Sloupec2]]=FALSE,\" \",\"Chyba\"))","v":" "},{"$f":"IF(Tabulka3[[#This Row],[Sloupec22]]=TRUE,\"Zastrik\",IF(Tabulka3[[#This Row],[Sloupec22]]=FALSE,\" \",\"Chyba\"))","v":" "},{"$f":"IF(Tabulka3[[#This Row],[Sloupec222]]=TRUE,\"Zastrik\",IF(Tabulka3[[#This Row],[Sloupec222]]=FALSE,\" \",\"Chyba\"))","v":" "},{"$f":"IF(Tabulka3[[#This Row],[Sloupec23]]=TRUE,\"Zastrik\",IF(Tabulka3[[#This Row],[Sloupec23]]=FALSE,\" \",\"Chyba\"))","v":" "},null,{"$f":"IF(AO58=\"\",30,AO58)","v":30},{"$f":"IF(Tabulka3[[#This Row],[Sloupec2]],($BB58*C58/1000000)*I58,\"\")","v":""},{"$f":"IF(Tabulka3[[#This Row],[Sloupec22]],($BB58*C58/1000000)*I58,\"\")","v":""},{"$f":"IF(Tabulka3[[#This Row],[Sloupec222]],($BB58*E58/1000000)*I58,\"\")","v":""},{"$f":"IF(Tabulka3[[#This Row],[Sloupec23]],($BB58*E58/1000000)*I58,\"\")","v":""},0,0,0]
["39.",null,null,"",null,"",null,"",null,"",null,null,null,null,null,null,null,null,null,null,{"$f":"IF(I59=\"\",\"\",Tabulka3[[#This Row],[Sloupec64]]+Tabulka3[[#This Row],[Sloupec63]]+BG59)","v":""},"",null,null,{"$f":"IF($I$13=\"ano\",Tabulka3[[#This Row],[Sloupec64]]*100,IF(OR($I$13=\"\",$I$13=\"ne\"),0,\"chyba\"))","v":0},1,false,false,false,false,{"$f":"IF(OR(Tabulka3[[#This Row],[Sloupec2]]=TRUE,Tabulka3[[#This Row],[Sloupec22]]=TRUE,Tabulka3[[#This Row],[Sloupec222]]=TRUE,Tabulka3[[#This Row],[Sloupec23]]=TRUE),1.1,1)","v":1},0,0,0,0,{"$f":"IF(Tabulka3[[#This Row],[Sloupec1]]=1,(C59*E59/1000000)*I59,((C59*E59/1000000)*I59)*2)","v":0},{"$f":"Tabulka3[[#This Row],[Sloupec3]]+Tabulka3[[#This Row],[Sloupec4]]+Tabulka3[[#This Row],[Sloupec5]]+Tabulka3[[#This Row],[Sloupec6]]","v":0},{"$f":"IF($I$12=\"\",0,VLOOKUP($I$12,Pomocné!C:E,2,FALSE))","v":1600},{"$f":"IF(Tabulka3[[#This Row],[Sloupec1]]=1,VLOOKUP($I$12,Tabulka1[],2,FALSE),VLOOKUP($I$12,Tabulka1[],3,FALSE))","v":1600},{"$f":"IF(U59=\"\",0,IF(Tabulka3[[#This Row],[Sloupec24]]=1,Tabulka3[[#This Row],[Sloupec64]]*Tabulka3[[#This Row],[Sloupec62]]+Tabulka3[[#This Row],[Sloupec63]]*Tabulka3[[#This Row],[Sloupec632]]+Y59,(Tabulka3[[#This Row],[Sloupec64]]*Tabulka3[[#This Row],[Sloupec62]]*Tabulka3[[#This Row],[Sloupec24]])+Tabulka3[[#This Row],[Sloupec63]]*Tabulka3[[#This Row],[Sloupec632]]+Y59))","v":0},null,"","","","lesk","ne","",{"$f":"IF(Tabulka3[[#This Row],[Sloupec1]]=1,\"Jednostranne\",IF(Tabulka3[[#This Row],[Sloupec1]]=2,\"Oboustranne\",\"Nezadano\"))","v":"Jednostranne"},{"$f":"IF(Tabulka3[[#This Row],[Sloupec2]]=TRUE,\"Zastrik\",IF(Tabulka3[[#This Row],[Sloupec2]]=FALSE,\" \",\"Chyba\"))","v":" "},{"$f":"IF(Tabulka3[[#This Row],[Sloupec22]]=TRUE,\"Zastrik\",IF(Tabulka3[[#This Row],[Sloupec22]]=FALSE,\" \",\"Chyba\"))","v":" "},{"$f":"IF(Tabulka3[[#This Row],[Sloupec222]]=TRUE,\"Zastrik\",IF(Tabulka3[[#This Row],[Sloupec222]]=FALSE,\" \",\"Chyba\"))","v":" "},{"$f":"IF(Tabulka3[[#This Row],[Sloupec23]]=TRUE,\"Zastrik\",IF(Tabulka3[[#This Row],[Sloupec23]]=FALSE,\" \",\"Chyba\"))","v":" "},null,{"$f":"IF(AO59=\"\",30,AO59)","v":30},{"$f":"IF(Tabulka3[[#This Row],[Sloupec2]],($BB59*C59/1000000)*I59,\"\")","v":""},{"$f":"IF(Tabulka3[[#This Row],[Sloupec22]],($BB59*C59/1000000)*I59,\"\")","v":""},{"$f":"IF(Tabulka3[[#This Row],[Sloupec222]],($BB59*E59/1000000)*I59,\"\")","v":""},{"$f":"IF(Tabulka3[[#This Row],[Sloupec23]],($BB59*E59/1000000)*I59,\"\")","v":""},0,0,0]
["40.",null,null,"",null,"",null,"",null,"",null,null,null,null,null,null,null,null,null,null,{"$f":"IF(I60=\"\",\"\",Tabulka3[[#This Row],[Sloupec64]]+Tabulka3[[#This Row],[Sloupec63]]+BG60)","v":""},"",null,null,{"$f":"IF($I$13=\"ano\",Tabulka3[[#This Row],[Sloupec64]]*100,IF(OR($I$13=\"\",$I$13=\"ne\"),0,\"chyba\"))","v":0},1,false,false,false,false,{"$f":"IF(OR(Tabulka3[[#This Row],[Sloupec2]]=TRUE,Tabulka3[[#This Row],[Sloupec22]]=TRUE,Tabulka3[[#This Row],[Sloupec222]]=TRUE,Tabulka3[[#This Row],[Sloupec23]]=TRUE),1.1,1)","v":1},0,0,0,0,{"$f":"IF(Tabulka3[[#This Row],[Sloupec1]]=1,(C60*E60/1000000)*I60,((C60*E60/1000000)*I60)*2)","v":0},{"$f":"Tabulka3[[#This Row],[Sloupec3]]+Tabulka3[[#This Row],[Sloupec4]]+Tabulka3[[#This Row],[Sloupec5]]+Tabulka3[[#This Row],[Sloupec6]]","v":0},{"$f":"IF($I$12=\"\",0,VLOOKUP($I$12,Pomocné!C:E,2,FALSE))","v":1600},{"$f":"IF(Tabulka3[[#This Row],[Sloupec1]]=1,VLOOKUP($I$12,Tabulka1[],2,FALSE),VLOOKUP($I$12,Tabulka1[],3,FALSE))","v":1600},{"$f":"IF(U60=\"\",0,IF(Tabulka3[[#This Row],[Sloupec24]]=1,Tabulka3[[#This Row],[Sloupec64]]*Tabulka3[[#This Row],[Sloupec62]]+Tabulka3[[#This Row],[Sloupec63]]*Tabulka3[[#This Row],[Sloupec632]]+Y60,(Tabulka3[[#This Row],[Sloupec64]]*Tabulka3[[#This Row],[Sloupec62]]*Tabulka3[[#This Row],[Sloupec24]])+Tabulka3[[#This Row],[Sloupec63]]*Tabulka3[[#This Row],[Sloupec632]]+Y60))","v":0},null,"","","","lesk","ne","",{"$f":"IF(Tabulka3[[#This Row],[Sloupec1]]=1,\"Jednostranne\",IF(Tabulka3[[#This Row],[Sloupec1]]=2,\"Oboustranne\",\"Nezadano\"))","v":"Jednostranne"},{"$f":"IF(Tabulka3[[#This Row],[Sloupec2]]=TRUE,\"Zastrik\",IF(Tabulka3[[#This Row],[Sloupec2]]=FALSE,\" \",\"Chyba\"))","v":" "},{"$f":"IF(Tabulka3[[#This Row],[Sloupec22]]=TRUE,\"Zastrik\",IF(Tabulka3[[#This Row],[Sloupec22]]=FALSE,\" \",\"Chyba\"))","v":" "},{"$f":"IF(Tabulka3[[#This Row],[Sloupec222]]=TRUE,\"Zastrik\",IF(Tabulka3[[#This Row],[Sloupec222]]=FALSE,\" \",\"Chyba\"))","v":" "},{"$f":"IF(Tabulka3[[#This Row],[Sloupec23]]=TRUE,\"Zastrik\",IF(Tabulka3[[#This Row],[Sloupec23]]=FALSE,\" \",\"Chyba\"))","v":" "},null,{"$f":"IF(AO60=\"\",30,AO60)","v":30},{"$f":"IF(Tabulka3[[#This Row],[Sloupec2]],($BB60*C60/1000000)*I60,\"\")","v":""},{"$f":"IF(Tabulka3[[#This Row],[Sloupec22]],($BB60*C60/1000000)*I60,\"\")","v":""},{"$f":"IF(Tabulka3[[#This Row],[Sloupec222]],($BB60*E60/1000000)*I60,\"\")","v":""},{"$f":"IF(Tabulka3[[#This Row],[Sloupec23]],($BB60*E60/1000000)*I60,\"\")","v":""},0,0,0]
["41.",null,null,"",null,"",null,"",null,"",null,null,null,null,null,null,null,null,null,null,{"$f":"IF(I61=\"\",\"\",Tabulka3[[#This Row],[Sloupec64]]+Tabulka3[[#This Row],[Sloupec63]]+BG61)","v":""},"",null,null,{"$f":"IF($I$13=\"ano\",Tabulka3[[#This Row],[Sloupec64]]*100,IF(OR($I$13=\"\",$I$13=\"ne\"),0,\"chyba\"))","v":0},1,false,false,false,false,{"$f":"IF(OR(Tabulka3[[#This Row],[Sloupec2]]=TRUE,Tabulka3[[#This Row],[Sloupec22]]=TRUE,Tabulka3[[#This Row],[Sloupec222]]=TRUE,Tabulka3[[#This Row],[Sloupec23]]=TRUE),1.1,1)","v":1},0,0,0,0,{"$f":"IF(Tabulka3[[#This Row],[Sloupec1]]=1,(C61*E61/1000000)*I61,((C61*E61/1000000)*I61)*2)","v":0},{"$f":"Tabulka3[[#This Row],[Sloupec3]]+Tabulka3[[#This Row],[Sloupec4]]+Tabulka3[[#This Row],[Sloupec5]]+Tabulka3[[#This Row],[Sloupec6]]","v":0},{"$f":"IF($I$12=\"\",0,VLOOKUP($I$12,Pomocné!C:E,2,FALSE))","v":1600},{"$f":"IF(Tabulka3[[#This Row],[Sloupec1]]=1,VLOOKUP($I$12,Tabulka1[],2,FALSE),VLOOKUP($I$12,Tabulka1[],3,FALSE))","v":1600},{"$f":"IF(U61=\"\",0,IF(Tabulka3[[#This Row],[Sloupec24]]=1,Tabulka3[[#This Row],[Sloupec64]]*Tabulka3[[#This Row],[Sloupec62]]+Tabulka3[[#This Row],[Sloupec63]]*Tabulka3[[#This Row],[Sloupec632]]+Y61,(Tabulka3[[#This Row],[Sloupec64]]*Tabulka3[[#This Row],[Sloupec62]]*Tabulka3[[#This Row],[Sloupec24]])+Tabulka3[[#This Row],[Sloupec63]]*Tabulka3[[#This Row],[Sloupec632]]+Y61))","v":0},null,"","","","lesk","ne","",{"$f":"IF(Tabulka3[[#This Row],[Sloupec1]]=1,\"Jednostranne\",IF(Tabulka3[[#This Row],[Sloupec1]]=2,\"Oboustranne\",\"Nezadano\"))","v":"Jednostranne"},{"$f":"IF(Tabulka3[[#This Row],[Sloupec2]]=TRUE,\"Zastrik\",IF(Tabulka3[[#This Row],[Sloupec2]]=FALSE,\" \",\"Chyba\"))","v":" "},{"$f":"IF(Tabulka3[[#This Row],[Sloupec22]]=TRUE,\"Zastrik\",IF(Tabulka3[[#This Row],[Sloupec22]]=FALSE,\" \",\"Chyba\"))","v":" "},{"$f":"IF(Tabulka3[[#This Row],[Sloupec222]]=TRUE,\"Zastrik\",IF(Tabulka3[[#This Row],[Sloupec222]]=FALSE,\" \",\"Chyba\"))","v":" "},{"$f":"IF(Tabulka3[[#This Row],[Sloupec23]]=TRUE,\"Zastrik\",IF(Tabulka3[[#This Row],[Sloupec23]]=FALSE,\" \",\"Chyba\"))","v":" "},null,{"$f":"IF(AO61=\"\",30,AO61)","v":30},{"$f":"IF(Tabulka3[[#This Row],[Sloupec2]],($BB61*C61/1000000)*I61,\"\")","v":""},{"$f":"IF(Tabulka3[[#This Row],[Sloupec22]],($BB61*C61/1000000)*I61,\"\")","v":""},{"$f":"IF(Tabulka3[[#This Row],[Sloupec222]],($BB61*E61/1000000)*I61,\"\")","v":""},{"$f":"IF(Tabulka3[[#This Row],[Sloupec23]],($BB61*E61/1000000)*I61,\"\")","v":""},0,0,0]
["42.",null,null,"",null,"",null,"",null,"",null,null,null,null,null,null,null,null,null,null,{"$f":"IF(I62=\"\",\"\",Tabulka3[[#This Row],[Sloupec64]]+Tabulka3[[#This Row],[Sloupec63]]+BG62)","v":""},"",null,null,{"$f":"IF($I$13=\"ano\",Tabulka3[[#This Row],[Sloupec64]]*100,IF(OR($I$13=\"\",$I$13=\"ne\"),0,\"chyba\"))","v":0},1,false,false,false,false,{"$f":"IF(OR(Tabulka3[[#This Row],[Sloupec2]]=TRUE,Tabulka3[[#This Row],[Sloupec22]]=TRUE,Tabulka3[[#This Row],[Sloupec222]]=TRUE,Tabulka3[[#This Row],[Sloupec23]]=TRUE),1.1,1)","v":1},0,0,0,0,{"$f":"IF(Tabulka3[[#This Row],[Sloupec1]]=1,(C62*E62/1000000)*I62,((C62*E62/1000000)*I62)*2)","v":0},{"$f":"Tabulka3[[#This Row],[Sloupec3]]+Tabulka3[[#This Row],[Sloupec4]]+Tabulka3[[#This Row],[Sloupec5]]+Tabulka3[[#This Row],[Sloupec6]]","v":0},{"$f":"IF($I$12=\"\",0,VLOOKUP($I$12,Pomocné!C:E,2,FALSE))","v":1600},{"$f":"IF(Tabulka3[[#This Row],[Sloupec1]]=1,VLOOKUP($I$12,Tabulka1[],2,FALSE),VLOOKUP($I$12,Tabulka1[],3,FALSE))","v":1600},{"$f":"IF(U62=\"\",0,IF(Tabulka3[[#This Row],[Sloupec24]]=1,Tabulka3[[#This Row],[Sloupec64]]*Tabulka3[[#This Row],[Sloupec62]]+Tabulka3[[#This Row],[Sloupec63]]*Tabulka3[[#This Row],[Sloupec632]]+Y62,(Tabulka3[[#This Row],[Sloupec64]]*Tabulka3[[#This Row],[Sloupec62]]*Tabulka3[[#This Row],[Sloupec24]])+Tabulka3[[#This Row],[Sloupec63]]*Tabulka3[[#This Row],[Sloupec632]]+Y62))","v":0},null,"","","","lesk","ne","",{"$f":"IF(Tabulka3[[#This Row],[Sloupec1]]=1,\"Jednostranne\",IF(Tabulka3[[#This Row],[Sloupec1]]=2,\"Oboustranne\",\"Nezadano\"))","v":"Jednostranne"},{"$f":"IF(Tabulka3[[#This Row],[Sloupec2]]=TRUE,\"Zastrik\",IF(Tabulka3[[#This Row],[Sloupec2]]=FALSE,\" \",\"Chyba\"))","v":" "},{"$f":"IF(Tabulka3[[#This Row],[Sloupec22]]=TRUE,\"Zastrik\",IF(Tabulka3[[#This Row],[Sloupec22]]=FALSE,\" \",\"Chyba\"))","v":" "},{"$f":"IF(Tabulka3[[#This Row],[Sloupec222]]=TRUE,\"Zastrik\",IF(Tabulka3[[#This Row],[Sloupec222]]=FALSE,\" \",\"Chyba\"))","v":" "},{"$f":"IF(Tabulka3[[#This Row],[Sloupec23]]=TRUE,\"Zastrik\",IF(Tabulka3[[#This Row],[Sloupec23]]=FALSE,\" \",\"Chyba\"))","v":" "},null,{"$f":"IF(AO62=\"\",30,AO62)","v":30},{"$f":"IF(Tabulka3[[#This Row],[Sloupec2]],($BB62*C62/1000000)*I62,\"\")","v":""},{"$f":"IF(Tabulka3[[#This Row],[Sloupec22]],($BB62*C62/1000000)*I62,\"\")","v":""},{"$f":"IF(Tabulka3[[#This Row],[Sloupec222]],($BB62*E62/1000000)*I62,\"\")","v":""},{"$f":"IF(Tabulka3[[#This Row],[Sloupec23]],($BB62*E62/1000000)*I62,\"\")","v":""},0,0,0]
["43.",null,null,"",null,"",null,"",null,"",null,null,null,null,null,null,null,null,null,null,{"$f":"IF(I63=\"\",\"\",Tabulka3[[#This Row],[Sloupec64]]+Tabulka3[[#This Row],[Sloupec63]]+BG63)","v":""},"",null,null,{"$f":"IF($I$13=\"ano\",Tabulka3[[#This Row],[Sloupec64]]*100,IF(OR($I$13=\"\",$I$13=\"ne\"),0,\"chyba\"))","v":0},1,false,false,false,false,{"$f":"IF(OR(Tabulka3[[#This Row],[Sloupec2]]=TRUE,Tabulka3[[#This Row],[Sloupec22]]=TRUE,Tabulka3[[#This Row],[Sloupec222]]=TRUE,Tabulka3[[#This Row],[Sloupec23]]=TRUE),1.1,1)","v":1},0,0,0,0,{"$f":"IF(Tabulka3[[#This Row],[Sloupec1]]=1,(C63*E63/1000000)*I63,((C63*E63/1000000)*I63)*2)","v":0},{"$f":"Tabulka3[[#This Row],[Sloupec3]]+Tabulka3[[#This Row],[Sloupec4]]+Tabulka3[[#This Row],[Sloupec5]]+Tabulka3[[#This Row],[Sloupec6]]","v":0},{"$f":"IF($I$12=\"\",0,VLOOKUP($I$12,Pomocné!C:E,2,FALSE))","v":1600},{"$f":"IF(Tabulka3[[#This Row],[Sloupec1]]=1,VLOOKUP($I$12,Tabulka1[],2,FALSE),VLOOKUP($I$12,Tabulka1[],3,FALSE))","v":1600},{"$f":"IF(U63=\"\",0,IF(Tabulka3[[#This Row],[Sloupec24]]=1,Tabulka3[[#This Row],[Sloupec64]]*Tabulka3[[#This Row],[Sloupec62]]+Tabulka3[[#This Row],[Sloupec63]]*Tabulka3[[#This Row],[Sloupec632]]+Y63,(Tabulka3[[#This Row],[Sloupec64]]*Tabulka3[[#This Row],[Sloupec62]]*Tabulka3[[#This Row],[Sloupec24]])+Tabulka3[[#This Row],[Sloupec63]]*Tabulka3[[#This Row],[Sloupec632]]+Y63))","v":0},null,"","","","lesk","ne","",{"$f":"IF(Tabulka3[[#This Row],[Sloupec1]]=1,\"Jednostranne\",IF(Tabulka3[[#This Row],[Sloupec1]]=2,\"Oboustranne\",\"Nezadano\"))","v":"Jednostranne"},{"$f":"IF(Tabulka3[[#This Row],[Sloupec2]]=TRUE,\"Zastrik\",IF(Tabulka3[[#This Row],[Sloupec2]]=FALSE,\" \",\"Chyba\"))","v":" "},{"$f":"IF(Tabulka3[[#This Row],[Sloupec22]]=TRUE,\"Zastrik\",IF(Tabulka3[[#This Row],[Sloupec22]]=FALSE,\" \",\"Chyba\"))","v":" "},{"$f":"IF(Tabulka3[[#This Row],[Sloupec222]]=TRUE,\"Zastrik\",IF(Tabulka3[[#This Row],[Sloupec222]]=FALSE,\" \",\"Chyba\"))","v":" "},{"$f":"IF(Tabulka3[[#This Row],[Sloupec23]]=TRUE,\"Zastrik\",IF(Tabulka3[[#This Row],[Sloupec23]]=FALSE,\" \",\"Chyba\"))","v":" "},null,{"$f":"IF(AO63=\"\",30,AO63)","v":30},{"$f":"IF(Tabulka3[[#This Row],[Sloupec2]],($BB63*C63/1000000)*I63,\"\")","v":""},{"$f":"IF(Tabulka3[[#This Row],[Sloupec22]],($BB63*C63/1000000)*I63,\"\")","v":""},{"$f":"IF(Tabulka3[[#This Row],[Sloupec222]],($BB63*E63/1000000)*I63,\"\")","v":""},{"$f":"IF(Tabulka3[[#This Row],[Sloupec23]],($BB63*E63/1000000)*I63,\"\")","v":""},0,0,0]
["44.",null,null,"",null,"",null,"",null,"",null,null,null,null,null,null,null,null,null,null,{"$f":"IF(I64=\"\",\"\",Tabulka3[[#This Row],[Sloupec64]]+Tabulka3[[#This Row],[Sloupec63]]+BG64)","v":""},"",null,null,{"$f":"IF($I$13=\"ano\",Tabulka3[[#This Row],[Sloupec64]]*100,IF(OR($I$13=\"\",$I$13=\"ne\"),0,\"chyba\"))","v":0},1,false,false,false,false,{"$f":"IF(OR(Tabulka3[[#This Row],[Sloupec2]]=TRUE,Tabulka3[[#This Row],[Sloupec22]]=TRUE,Tabulka3[[#This Row],[Sloupec222]]=TRUE,Tabulka3[[#This Row],[Sloupec23]]=TRUE),1.1,1)","v":1},0,0,0,0,{"$f":"IF(Tabulka3[[#This Row],[Sloupec1]]=1,(C64*E64/1000000)*I64,((C64*E64/1000000)*I64)*2)","v":0},{"$f":"Tabulka3[[#This Row],[Sloupec3]]+Tabulka3[[#This Row],[Sloupec4]]+Tabulka3[[#This Row],[Sloupec5]]+Tabulka3[[#This Row],[Sloupec6]]","v":0},{"$f":"IF($I$12=\"\",0,VLOOKUP($I$12,Pomocné!C:E,2,FALSE))","v":1600},{"$f":"IF(Tabulka3[[#This Row],[Sloupec1]]=1,VLOOKUP($I$12,Tabulka1[],2,FALSE),VLOOKUP($I$12,Tabulka1[],3,FALSE))","v":1600},{"$f":"IF(U64=\"\",0,IF(Tabulka3[[#This Row],[Sloupec24]]=1,Tabulka3[[#This Row],[Sloupec64]]*Tabulka3[[#This Row],[Sloupec62]]+Tabulka3[[#This Row],[Sloupec63]]*Tabulka3[[#This Row],[Sloupec632]]+Y64,(Tabulka3[[#This Row],[Sloupec64]]*Tabulka3[[#This Row],[Sloupec62]]*Tabulka3[[#This Row],[Sloupec24]])+Tabulka3[[#This Row],[Sloupec63]]*Tabulka3[[#This Row],[Sloupec632]]+Y64))","v":0},null,"","","","lesk","ne","",{"$f":"IF(Tabulka3[[#This Row],[Sloupec1]]=1,\"Jednostranne\",IF(Tabulka3[[#This Row],[Sloupec1]]=2,\"Oboustranne\",\"Nezadano\"))","v":"Jednostranne"},{"$f":"IF(Tabulka3[[#This Row],[Sloupec2]]=TRUE,\"Zastrik\",IF(Tabulka3[[#This Row],[Sloupec2]]=FALSE,\" \",\"Chyba\"))","v":" "},{"$f":"IF(Tabulka3[[#This Row],[Sloupec22]]=TRUE,\"Zastrik\",IF(Tabulka3[[#This Row],[Sloupec22]]=FALSE,\" \",\"Chyba\"))","v":" "},{"$f":"IF(Tabulka3[[#This Row],[Sloupec222]]=TRUE,\"Zastrik\",IF(Tabulka3[[#This Row],[Sloupec222]]=FALSE,\" \",\"Chyba\"))","v":" "},{"$f":"IF(Tabulka3[[#This Row],[Sloupec23]]=TRUE,\"Zastrik\",IF(Tabulka3[[#This Row],[Sloupec23]]=FALSE,\" \",\"Chyba\"))","v":" "},null,{"$f":"IF(AO64=\"\",30,AO64)","v":30},{"$f":"IF(Tabulka3[[#This Row],[Sloupec2]],($BB64*C64/1000000)*I64,\"\")","v":""},{"$f":"IF(Tabulka3[[#This Row],[Sloupec22]],($BB64*C64/1000000)*I64,\"\")","v":""},{"$f":"IF(Tabulka3[[#This Row],[Sloupec222]],($BB64*E64/1000000)*I64,\"\")","v":""},{"$f":"IF(Tabulka3[[#This Row],[Sloupec23]],($BB64*E64/1000000)*I64,\"\")","v":""},0,0,0]
["45.",null,null,"",null,"",null,"",null,"",null,null,null,null,null,null,null,null,null,null,{"$f":"IF(I65=\"\",\"\",Tabulka3[[#This Row],[Sloupec64]]+Tabulka3[[#This Row],[Sloupec63]]+BG65)","v":""},"",null,null,{"$f":"IF($I$13=\"ano\",Tabulka3[[#This Row],[Sloupec64]]*100,IF(OR($I$13=\"\",$I$13=\"ne\"),0,\"chyba\"))","v":0},1,false,false,false,false,{"$f":"IF(OR(Tabulka3[[#This Row],[Sloupec2]]=TRUE,Tabulka3[[#This Row],[Sloupec22]]=TRUE,Tabulka3[[#This Row],[Sloupec222]]=TRUE,Tabulka3[[#This Row],[Sloupec23]]=TRUE),1.1,1)","v":1},0,0,0,0,{"$f":"IF(Tabulka3[[#This Row],[Sloupec1]]=1,(C65*E65/1000000)*I65,((C65*E65/1000000)*I65)*2)","v":0},{"$f":"Tabulka3[[#This Row],[Sloupec3]]+Tabulka3[[#This Row],[Sloupec4]]+Tabulka3[[#This Row],[Sloupec5]]+Tabulka3[[#This Row],[Sloupec6]]","v":0},{"$f":"IF($I$12=\"\",0,VLOOKUP($I$12,Pomocné!C:E,2,FALSE))","v":1600},{"$f":"IF(Tabulka3[[#This Row],[Sloupec1]]=1,VLOOKUP($I$12,Tabulka1[],2,FALSE),VLOOKUP($I$12,Tabulka1[],3,FALSE))","v":1600},{"$f":"IF(U65=\"\",0,IF(Tabulka3[[#This Row],[Sloupec24]]=1,Tabulka3[[#This Row],[Sloupec64]]*Tabulka3[[#This Row],[Sloupec62]]+Tabulka3[[#This Row],[Sloupec63]]*Tabulka3[[#This Row],[Sloupec632]]+Y65,(Tabulka3[[#This Row],[Sloupec64]]*Tabulka3[[#This Row],[Sloupec62]]*Tabulka3[[#This Row],[Sloupec24]])+Tabulka3[[#This Row],[Sloupec63]]*Tabulka3[[#This Row],[Sloupec632]]+Y65))","v":0},null,"","","","lesk","ne","",{"$f":"IF(Tabulka3[[#This Row],[Sloupec1]]=1,\"Jednostranne\",IF(Tabulka3[[#This Row],[Sloupec1]]=2,\"Oboustranne\",\"Nezadano\"))","v":"Jednostranne"},{"$f":"IF(Tabulka3[[#This Row],[Sloupec2]]=TRUE,\"Zastrik\",IF(Tabulka3[[#This Row],[Sloupec2]]=FALSE,\" \",\"Chyba\"))","v":" "},{"$f":"IF(Tabulka3[[#This Row],[Sloupec22]]=TRUE,\"Zastrik\",IF(Tabulka3[[#This Row],[Sloupec22]]=FALSE,\" \",\"Chyba\"))","v":" "},{"$f":"IF(Tabulka3[[#This Row],[Sloupec222]]=TRUE,\"Zastrik\",IF(Tabulka3[[#This Row],[Sloupec222]]=FALSE,\" \",\"Chyba\"))","v":" "},{"$f":"IF(Tabulka3[[#This Row],[Sloupec23]]=TRUE,\"Zastrik\",IF(Tabulka3[[#This Row],[Sloupec23]]=FALSE,\" \",\"Chyba\"))","v":" "},null,{"$f":"IF(AO65=\"\",30,AO65)","v":30},{"$f":"IF(Tabulka3[[#This Row],[Sloupec2]],($BB65*C65/1000000)*I65,\"\")","v":""},{"$f":"IF(Tabulka3[[#This Row],[Sloupec22]],($BB65*C65/1000000)*I65,\"\")","v":""},{"$f":"IF(Tabulka3[[#This Row],[Sloupec222]],($BB65*E65/1000000)*I65,\"\")","v":""},{"$f":"IF(Tabulka3[[#This Row],[Sloupec23]],($BB65*E65/1000000)*I65,\"\")","v":""},0,0,0]
["46.",null,null,"",null,"",null,"",null,"",null,null,null,null,null,null,null,null,null,null,{"$f":"IF(I66=\"\",\"\",Tabulka3[[#This Row],[Sloupec64]]+Tabulka3[[#This Row],[Sloupec63]]+BG66)","v":""},"",null,null,{"$f":"IF($I$13=\"ano\",Tabulka3[[#This Row],[Sloupec64]]*100,IF(OR($I$13=\"\",$I$13=\"ne\"),0,\"chyba\"))","v":0},1,false,false,false,false,{"$f":"IF(OR(Tabulka3[[#This Row],[Sloupec2]]=TRUE,Tabulka3[[#This Row],[Sloupec22]]=TRUE,Tabulka3[[#This Row],[Sloupec222]]=TRUE,Tabulka3[[#This Row],[Sloupec23]]=TRUE),1.1,1)","v":1},0,0,0,0,{"$f":"IF(Tabulka3[[#This Row],[Sloupec1]]=1,(C66*E66/1000000)*I66,((C66*E66/1000000)*I66)*2)","v":0},{"$f":"Tabulka3[[#This Row],[Sloupec3]]+Tabulka3[[#This Row],[Sloupec4]]+Tabulka3[[#This Row],[Sloupec5]]+Tabulka3[[#This Row],[Sloupec6]]","v":0},{"$f":"IF($I$12=\"\",0,VLOOKUP($I$12,Pomocné!C:E,2,FALSE))","v":1600},{"$f":"IF(Tabulka3[[#This Row],[Sloupec1]]=1,VLOOKUP($I$12,Tabulka1[],2,FALSE),VLOOKUP($I$12,Tabulka1[],3,FALSE))","v":1600},{"$f":"IF(U66=\"\",0,IF(Tabulka3[[#This Row],[Sloupec24]]=1,Tabulka3[[#This Row],[Sloupec64]]*Tabulka3[[#This Row],[Sloupec62]]+Tabulka3[[#This Row],[Sloupec63]]*Tabulka3[[#This Row],[Sloupec632]]+Y66,(Tabulka3[[#This Row],[Sloupec64]]*Tabulka3[[#This Row],[Sloupec62]]*Tabulka3[[#This Row],[Sloupec24]])+Tabulka3[[#This Row],[Sloupec63]]*Tabulka3[[#This Row],[Sloupec632]]+Y66))","v":0},null,"","","","lesk","ne","",{"$f":"IF(Tabulka3[[#This Row],[Sloupec1]]=1,\"Jednostranne\",IF(Tabulka3[[#This Row],[Sloupec1]]=2,\"Oboustranne\",\"Nezadano\"))","v":"Jednostranne"},{"$f":"IF(Tabulka3[[#This Row],[Sloupec2]]=TRUE,\"Zastrik\",IF(Tabulka3[[#This Row],[Sloupec2]]=FALSE,\" \",\"Chyba\"))","v":" "},{"$f":"IF(Tabulka3[[#This Row],[Sloupec22]]=TRUE,\"Zastrik\",IF(Tabulka3[[#This Row],[Sloupec22]]=FALSE,\" \",\"Chyba\"))","v":" "},{"$f":"IF(Tabulka3[[#This Row],[Sloupec222]]=TRUE,\"Zastrik\",IF(Tabulka3[[#This Row],[Sloupec222]]=FALSE,\" \",\"Chyba\"))","v":" "},{"$f":"IF(Tabulka3[[#This Row],[Sloupec23]]=TRUE,\"Zastrik\",IF(Tabulka3[[#This Row],[Sloupec23]]=FALSE,\" \",\"Chyba\"))","v":" "},null,{"$f":"IF(AO66=\"\",30,AO66)","v":30},{"$f":"IF(Tabulka3[[#This Row],[Sloupec2]],($BB66*C66/1000000)*I66,\"\")","v":""},{"$f":"IF(Tabulka3[[#This Row],[Sloupec22]],($BB66*C66/1000000)*I66,\"\")","v":""},{"$f":"IF(Tabulka3[[#This Row],[Sloupec222]],($BB66*E66/1000000)*I66,\"\")","v":""},{"$f":"IF(Tabulka3[[#This Row],[Sloupec23]],($BB66*E66/1000000)*I66,\"\")","v":""},0,0,0]
["47.",null,null,"",null,"",null,"",null,"",null,null,null,null,null,null,null,null,null,null,{"$f":"IF(I67=\"\",\"\",Tabulka3[[#This Row],[Sloupec64]]+Tabulka3[[#This Row],[Sloupec63]]+BG67)","v":""},"",null,null,{"$f":"IF($I$13=\"ano\",Tabulka3[[#This Row],[Sloupec64]]*100,IF(OR($I$13=\"\",$I$13=\"ne\"),0,\"chyba\"))","v":0},1,false,false,false,false,{"$f":"IF(OR(Tabulka3[[#This Row],[Sloupec2]]=TRUE,Tabulka3[[#This Row],[Sloupec22]]=TRUE,Tabulka3[[#This Row],[Sloupec222]]=TRUE,Tabulka3[[#This Row],[Sloupec23]]=TRUE),1.1,1)","v":1},0,0,0,0,{"$f":"IF(Tabulka3[[#This Row],[Sloupec1]]=1,(C67*E67/1000000)*I67,((C67*E67/1000000)*I67)*2)","v":0},{"$f":"Tabulka3[[#This Row],[Sloupec3]]+Tabulka3[[#This Row],[Sloupec4]]+Tabulka3[[#This Row],[Sloupec5]]+Tabulka3[[#This Row],[Sloupec6]]","v":0},{"$f":"IF($I$12=\"\",0,VLOOKUP($I$12,Pomocné!C:E,2,FALSE))","v":1600},{"$f":"IF(Tabulka3[[#This Row],[Sloupec1]]=1,VLOOKUP($I$12,Tabulka1[],2,FALSE),VLOOKUP($I$12,Tabulka1[],3,FALSE))","v":1600},{"$f":"IF(U67=\"\",0,IF(Tabulka3[[#This Row],[Sloupec24]]=1,Tabulka3[[#This Row],[Sloupec64]]*Tabulka3[[#This Row],[Sloupec62]]+Tabulka3[[#This Row],[Sloupec63]]*Tabulka3[[#This Row],[Sloupec632]]+Y67,(Tabulka3[[#This Row],[Sloupec64]]*Tabulka3[[#This Row],[Sloupec62]]*Tabulka3[[#This Row],[Sloupec24]])+Tabulka3[[#This Row],[Sloupec63]]*Tabulka3[[#This Row],[Sloupec632]]+Y67))","v":0},null,"","","","lesk","ne","",{"$f":"IF(Tabulka3[[#This Row],[Sloupec1]]=1,\"Jednostranne\",IF(Tabulka3[[#This Row],[Sloupec1]]=2,\"Oboustranne\",\"Nezadano\"))","v":"Jednostranne"},{"$f":"IF(Tabulka3[[#This Row],[Sloupec2]]=TRUE,\"Zastrik\",IF(Tabulka3[[#This Row],[Sloupec2]]=FALSE,\" \",\"Chyba\"))","v":" "},{"$f":"IF(Tabulka3[[#This Row],[Sloupec22]]=TRUE,\"Zastrik\",IF(Tabulka3[[#This Row],[Sloupec22]]=FALSE,\" \",\"Chyba\"))","v":" "},{"$f":"IF(Tabulka3[[#This Row],[Sloupec222]]=TRUE,\"Zastrik\",IF(Tabulka3[[#This Row],[Sloupec222]]=FALSE,\" \",\"Chyba\"))","v":" "},{"$f":"IF(Tabulka3[[#This Row],[Sloupec23]]=TRUE,\"Zastrik\",IF(Tabulka3[[#This Row],[Sloupec23]]=FALSE,\" \",\"Chyba\"))","v":" "},null,{"$f":"IF(AO67=\"\",30,AO67)","v":30},{"$f":"IF(Tabulka3[[#This Row],[Sloupec2]],($BB67*C67/1000000)*I67,\"\")","v":""},{"$f":"IF(Tabulka3[[#This Row],[Sloupec22]],($BB67*C67/1000000)*I67,\"\")","v":""},{"$f":"IF(Tabulka3[[#This Row],[Sloupec222]],($BB67*E67/1000000)*I67,\"\")","v":""},{"$f":"IF(Tabulka3[[#This Row],[Sloupec23]],($BB67*E67/1000000)*I67,\"\")","v":""},0,0,0]
["48.",null,null,"",null,"",null,"",null,"",null,null,null,null,null,null,null,null,null,null,{"$f":"IF(I68=\"\",\"\",Tabulka3[[#This Row],[Sloupec64]]+Tabulka3[[#This Row],[Sloupec63]]+BG68)","v":""},"",null,null,{"$f":"IF($I$13=\"ano\",Tabulka3[[#This Row],[Sloupec64]]*100,IF(OR($I$13=\"\",$I$13=\"ne\"),0,\"chyba\"))","v":0},1,false,false,false,false,{"$f":"IF(OR(Tabulka3[[#This Row],[Sloupec2]]=TRUE,Tabulka3[[#This Row],[Sloupec22]]=TRUE,Tabulka3[[#This Row],[Sloupec222]]=TRUE,Tabulka3[[#This Row],[Sloupec23]]=TRUE),1.1,1)","v":1},0,0,0,0,{"$f":"IF(Tabulka3[[#This Row],[Sloupec1]]=1,(C68*E68/1000000)*I68,((C68*E68/1000000)*I68)*2)","v":0},{"$f":"Tabulka3[[#This Row],[Sloupec3]]+Tabulka3[[#This Row],[Sloupec4]]+Tabulka3[[#This Row],[Sloupec5]]+Tabulka3[[#This Row],[Sloupec6]]","v":0},{"$f":"IF($I$12=\"\",0,VLOOKUP($I$12,Pomocné!C:E,2,FALSE))","v":1600},{"$f":"IF(Tabulka3[[#This Row],[Sloupec1]]=1,VLOOKUP($I$12,Tabulka1[],2,FALSE),VLOOKUP($I$12,Tabulka1[],3,FALSE))","v":1600},{"$f":"IF(U68=\"\",0,IF(Tabulka3[[#This Row],[Sloupec24]]=1,Tabulka3[[#This Row],[Sloupec64]]*Tabulka3[[#This Row],[Sloupec62]]+Tabulka3[[#This Row],[Sloupec63]]*Tabulka3[[#This Row],[Sloupec632]]+Y68,(Tabulka3[[#This Row],[Sloupec64]]*Tabulka3[[#This Row],[Sloupec62]]*Tabulka3[[#This Row],[Sloupec24]])+Tabulka3[[#This Row],[Sloupec63]]*Tabulka3[[#This Row],[Sloupec632]]+Y68))","v":0},null,"","","","lesk","ne","",{"$f":"IF(Tabulka3[[#This Row],[Sloupec1]]=1,\"Jednostranne\",IF(Tabulka3[[#This Row],[Sloupec1]]=2,\"Oboustranne\",\"Nezadano\"))","v":"Jednostranne"},{"$f":"IF(Tabulka3[[#This Row],[Sloupec2]]=TRUE,\"Zastrik\",IF(Tabulka3[[#This Row],[Sloupec2]]=FALSE,\" \",\"Chyba\"))","v":" "},{"$f":"IF(Tabulka3[[#This Row],[Sloupec22]]=TRUE,\"Zastrik\",IF(Tabulka3[[#This Row],[Sloupec22]]=FALSE,\" \",\"Chyba\"))","v":" "},{"$f":"IF(Tabulka3[[#This Row],[Sloupec222]]=TRUE,\"Zastrik\",IF(Tabulka3[[#This Row],[Sloupec222]]=FALSE,\" \",\"Chyba\"))","v":" "},{"$f":"IF(Tabulka3[[#This Row],[Sloupec23]]=TRUE,\"Zastrik\",IF(Tabulka3[[#This Row],[Sloupec23]]=FALSE,\" \",\"Chyba\"))","v":" "},null,{"$f":"IF(AO68=\"\",30,AO68)","v":30},{"$f":"IF(Tabulka3[[#This Row],[Sloupec2]],($BB68*C68/1000000)*I68,\"\")","v":""},{"$f":"IF(Tabulka3[[#This Row],[Sloupec22]],($BB68*C68/1000000)*I68,\"\")","v":""},{"$f":"IF(Tabulka3[[#This Row],[Sloupec222]],($BB68*E68/1000000)*I68,\"\")","v":""},{"$f":"IF(Tabulka3[[#This Row],[Sloupec23]],($BB68*E68/1000000)*I68,\"\")","v":""},0,0,0]
["49.",null,null,"",null,"",null,"",null,"",null,null,null,null,null,null,null,null,null,null,{"$f":"IF(I69=\"\",\"\",Tabulka3[[#This Row],[Sloupec64]]+Tabulka3[[#This Row],[Sloupec63]]+BG69)","v":""},"",null,null,{"$f":"IF($I$13=\"ano\",Tabulka3[[#This Row],[Sloupec64]]*100,IF(OR($I$13=\"\",$I$13=\"ne\"),0,\"chyba\"))","v":0},1,false,false,false,false,{"$f":"IF(OR(Tabulka3[[#This Row],[Sloupec2]]=TRUE,Tabulka3[[#This Row],[Sloupec22]]=TRUE,Tabulka3[[#This Row],[Sloupec222]]=TRUE,Tabulka3[[#This Row],[Sloupec23]]=TRUE),1.1,1)","v":1},0,0,0,0,{"$f":"IF(Tabulka3[[#This Row],[Sloupec1]]=1,(C69*E69/1000000)*I69,((C69*E69/1000000)*I69)*2)","v":0},{"$f":"Tabulka3[[#This Row],[Sloupec3]]+Tabulka3[[#This Row],[Sloupec4]]+Tabulka3[[#This Row],[Sloupec5]]+Tabulka3[[#This Row],[Sloupec6]]","v":0},{"$f":"IF($I$12=\"\",0,VLOOKUP($I$12,Pomocné!C:E,2,FALSE))","v":1600},{"$f":"IF(Tabulka3[[#This Row],[Sloupec1]]=1,VLOOKUP($I$12,Tabulka1[],2,FALSE),VLOOKUP($I$12,Tabulka1[],3,FALSE))","v":1600},{"$f":"IF(U69=\"\",0,IF(Tabulka3[[#This Row],[Sloupec24]]=1,Tabulka3[[#This Row],[Sloupec64]]*Tabulka3[[#This Row],[Sloupec62]]+Tabulka3[[#This Row],[Sloupec63]]*Tabulka3[[#This Row],[Sloupec632]]+Y69,(Tabulka3[[#This Row],[Sloupec64]]*Tabulka3[[#This Row],[Sloupec62]]*Tabulka3[[#This Row],[Sloupec24]])+Tabulka3[[#This Row],[Sloupec63]]*Tabulka3[[#This Row],[Sloupec632]]+Y69))","v":0},null,"","","","lesk","ne","",{"$f":"IF(Tabulka3[[#This Row],[Sloupec1]]=1,\"Jednostranne\",IF(Tabulka3[[#This Row],[Sloupec1]]=2,\"Oboustranne\",\"Nezadano\"))","v":"Jednostranne"},{"$f":"IF(Tabulka3[[#This Row],[Sloupec2]]=TRUE,\"Zastrik\",IF(Tabulka3[[#This Row],[Sloupec2]]=FALSE,\" \",\"Chyba\"))","v":" "},{"$f":"IF(Tabulka3[[#This Row],[Sloupec22]]=TRUE,\"Zastrik\",IF(Tabulka3[[#This Row],[Sloupec22]]=FALSE,\" \",\"Chyba\"))","v":" "},{"$f":"IF(Tabulka3[[#This Row],[Sloupec222]]=TRUE,\"Zastrik\",IF(Tabulka3[[#This Row],[Sloupec222]]=FALSE,\" \",\"Chyba\"))","v":" "},{"$f":"IF(Tabulka3[[#This Row],[Sloupec23]]=TRUE,\"Zastrik\",IF(Tabulka3[[#This Row],[Sloupec23]]=FALSE,\" \",\"Chyba\"))","v":" "},null,{"$f":"IF(AO69=\"\",30,AO69)","v":30},{"$f":"IF(Tabulka3[[#This Row],[Sloupec2]],($BB69*C69/1000000)*I69,\"\")","v":""},{"$f":"IF(Tabulka3[[#This Row],[Sloupec22]],($BB69*C69/1000000)*I69,\"\")","v":""},{"$f":"IF(Tabulka3[[#This Row],[Sloupec222]],($BB69*E69/1000000)*I69,\"\")","v":""},{"$f":"IF(Tabulka3[[#This Row],[Sloupec23]],($BB69*E69/1000000)*I69,\"\")","v":""},0,0,0]
["50.",null,null,"",null,"",null,"",null,"",null,null,null,null,null,null,null,null,null,null,{"$f":"IF(I70=\"\",\"\",Tabulka3[[#This Row],[Sloupec64]]+Tabulka3[[#This Row],[Sloupec63]]+BG70)","v":""},"",null,null,{"$f":"IF($I$13=\"ano\",Tabulka3[[#This Row],[Sloupec64]]*100,IF(OR($I$13=\"\",$I$13=\"ne\"),0,\"chyba\"))","v":0},1,false,false,false,false,{"$f":"IF(OR(Tabulka3[[#This Row],[Sloupec2]]=TRUE,Tabulka3[[#This Row],[Sloupec22]]=TRUE,Tabulka3[[#This Row],[Sloupec222]]=TRUE,Tabulka3[[#This Row],[Sloupec23]]=TRUE),1.1,1)","v":1},0,0,0,0,{"$f":"IF(Tabulka3[[#This Row],[Sloupec1]]=1,(C70*E70/1000000)*I70,((C70*E70/1000000)*I70)*2)","v":0},{"$f":"Tabulka3[[#This Row],[Sloupec3]]+Tabulka3[[#This Row],[Sloupec4]]+Tabulka3[[#This Row],[Sloupec5]]+Tabulka3[[#This Row],[Sloupec6]]","v":0},{"$f":"IF($I$12=\"\",0,VLOOKUP($I$12,Pomocné!C:E,2,FALSE))","v":1600},{"$f":"IF(Tabulka3[[#This Row],[Sloupec1]]=1,VLOOKUP($I$12,Tabulka1[],2,FALSE),VLOOKUP($I$12,Tabulka1[],3,FALSE))","v":1600},{"$f":"IF(U70=\"\",0,IF(Tabulka3[[#This Row],[Sloupec24]]=1,Tabulka3[[#This Row],[Sloupec64]]*Tabulka3[[#This Row],[Sloupec62]]+Tabulka3[[#This Row],[Sloupec63]]*Tabulka3[[#This Row],[Sloupec632]]+Y70,(Tabulka3[[#This Row],[Sloupec64]]*Tabulka3[[#This Row],[Sloupec62]]*Tabulka3[[#This Row],[Sloupec24]])+Tabulka3[[#This Row],[Sloupec63]]*Tabulka3[[#This Row],[Sloupec632]]+Y70))","v":0},null,"","","","lesk","ne","",{"$f":"IF(Tabulka3[[#This Row],[Sloupec1]]=1,\"Jednostranne\",IF(Tabulka3[[#This Row],[Sloupec1]]=2,\"Oboustranne\",\"Nezadano\"))","v":"Jednostranne"},{"$f":"IF(Tabulka3[[#This Row],[Sloupec2]]=TRUE,\"Zastrik\",IF(Tabulka3[[#This Row],[Sloupec2]]=FALSE,\" \",\"Chyba\"))","v":" "},{"$f":"IF(Tabulka3[[#This Row],[Sloupec22]]=TRUE,\"Zastrik\",IF(Tabulka3[[#This Row],[Sloupec22]]=FALSE,\" \",\"Chyba\"))","v":" "},{"$f":"IF(Tabulka3[[#This Row],[Sloupec222]]=TRUE,\"Zastrik\",IF(Tabulka3[[#This Row],[Sloupec222]]=FALSE,\" \",\"Chyba\"))","v":" "},{"$f":"IF(Tabulka3[[#This Row],[Sloupec23]]=TRUE,\"Zastrik\",IF(Tabulka3[[#This Row],[Sloupec23]]=FALSE,\" \",\"Chyba\"))","v":" "},null,{"$f":"IF(AO70=\"\",30,AO70)","v":30},{"$f":"IF(Tabulka3[[#This Row],[Sloupec2]],($BB70*C70/1000000)*I70,\"\")","v":""},{"$f":"IF(Tabulka3[[#This Row],[Sloupec22]],($BB70*C70/1000000)*I70,\"\")","v":""},{"$f":"IF(Tabulka3[[#This Row],[Sloupec222]],($BB70*E70/1000000)*I70,\"\")","v":""},{"$f":"IF(Tabulka3[[#This Row],[Sloupec23]],($BB70*E70/1000000)*I70,\"\")","v":""},0,0,0]
[null,null,null,null,null,null,null,null,null,null,null,null,null,null,null,null,null,null,null,null,null,null,null,null,null,null,null,null,null,null,null,null,null,null,null,null,null,null,null,null,null,null,null,null,null,null,null,null,null,null,null,null,null,null,null,null,null,"Celkem zástřiky všechny",{"$f":"SUM(BG22:BG70)","v":0},{"$f":"SUM(BH22:BH70)","v":0},{"$f":"SUM(BI22:BI70)","v":0}]